Peptide,PTM,ModifiedAA,ModifiedPosition,PeptideUniqueToGene,ExperimentDesc,ExpID,PubmedID,ScoreType,IdentScore,LocProb,Log2FChange,PQ-val,QuantSig,PEP,MassErrorPPM
VDMSIISYDEKHGVSTTGGR,nt,V,22,true,"Arg/N-end rule pathway Roots",80,25728785,"MASCOT Score",38.6100000,,,,,0.0010720000136644,
VDMSIISYDEKHGVSTTGGR,nt,V,22,true,"HUNTER N-terminome: legumain, GluC and trypsin",119,31951383,"MaxQuant score",66.5360000,,,,,,
VDMSIISYDE,nt,V,22,true,"N-terminal ChaFRADIC",92,26010716,"MASCOT Score",35.2500000,,,,,0.00063590001082048,
FEIFKDNLR,ub,K,77,false,"Arabidopsis ubiquitination COFRADIC",40,26744219,"MaxQuant Score",77.6620000,1.0000000,,,,0.0080000003799796,0.7000000
FVDEHNEKNLSYR,ng,N,90,true,"Conserved N-glycosylation",74,22633491,"MaxQuant Score",211.6300000,0.9980000,,,,4.3690001143827E-32,-0.2910000
FVDEHNEKNLSYR,ng,N,90,true,"N-Glycopeptide Profiling in Arabidopsis Infloresce",132,27067053,"MOWSE score",37.3000000,,,,,0.00018000000272878,
FVDEHNEKNLSYR,ng,N,90,true,"N-linked Glycan Micro-heterogeneity Arabidopsis",134,29237727,,,,,,,,
FVDEHNEKNLSYR,ng,N,90,true,"UDP-GlcNAc transporter glycopeptide analysis",135,30224661,,,,,,,7.0130787207745E-5,0.8000000
GDELPESIDWR,nt,G,134,true,"Tic56 chloroplast import - tic56-1",89c,25588737,XCorr,2.7811952,,,,,,
GDELPESIDWR,nt,G,134,true,"Arg/N-end rule seed, prt6 vs. Wt",99,29168982,"MASCOT Score",35.8700000,,-0.2774696,0.0753819,NO,0.025280000641942,-0.9589646
GDELPESIDWR,nt,G,134,true,"HUNTER N-terminome: legumain, GluC and trypsin",119,31951383,"MaxQuant score",64.2970000,,,,,,
GDELPESIDWR,nta,G,134,true,"FtsH12 N-terminome: WT / FtsH12 knockdown miRNA",118,33216923,"MaxQuant score",51.7260000,,-0.1233692,0.4202389,NO,8.6999997483961E-11,
DELPESIDWRKKGAVAEVKD,nt,D,135,true,"HUNTER N-terminome: legumain, GluC and trypsin",119,31951383,"MaxQuant score",166.2900000,,,,,,
DELPESIDWR,nt,D,135,true,"Arg/N-end rule pathway Roots",80,25728785,"MASCOT Score",39.1800000,,,,,0.0034199999645352,
DELPESIDWR,nt,D,135,true,"Tic56 chloroplast import - tic56-1",89c,25588737,XCorr,2.5022950,,,,,,
DELPESIDWR,nt,D,135,true,"N-terminal ChaFRADIC",92,26010716,"MASCOT Score",34.8200000,,,,,0.0087770000100136,
DELPESIDWR,nt,D,135,true,"Stromal N-terminome",96,26371235,"MASCOT Score",43.1900000,,,,,,
DELPESIDWR,nt,D,135,true,"Arg/N-end rule seed, prt6 vs. Wt",99,29168982,"MASCOT Score",44.1200000,,-1.0179691,0.0004470,YES,0.0088320001959801,-1.8253024
DELPESIDWR,nt,D,135,true,"FtsH12 N-terminome: WT / FtsH12 knockdown miRNA",118,33216923,"MaxQuant score",67.8660000,,-0.5281284,0.0136549,NO,0.002208000048995,
DELPESIDWR,nt,D,135,true,"HUNTER N-terminome: legumain, GluC and trypsin",119,31951383,"MaxQuant score",201.2100000,,,,,,
DELPESID,nt,D,135,true,"HUNTER N-terminome: legumain, GluC and trypsin",119,31951383,"MaxQuant score",138.0700000,,,,,,
ELPESIDWR,nt,E,136,true,"N-terminal ChaFRADIC",92,26010716,"MASCOT Score",30.7200000,,,,,0.00010350000229664,
ELPESIDWR,nt,E,136,true,"Arg/N-end rule seed, prt6 vs. Wt",99,29168982,"MASCOT Score",42.5000000,,-0.8123536,0.0035189,NO,0.020980000495911,-1.1095788
ELPESIDWR,nt,E,136,true,"FtsH12 N-terminome: WT / FtsH12 knockdown miRNA",118,33216923,"MaxQuant score",177.3600000,,4.3563275,0.0004450,YES,9.6500004168054E-12,
ELPESIDWR,nt,E,136,true,"HUNTER N-terminome: legumain, GluC and trypsin",119,31951383,"MaxQuant score",92.4390000,,,,,,
LPESIDWR,nt,L,137,true,"N-terminal ChaFRADIC",92,26010716,"MASCOT Score",29.2800000,,,,,0.016990000382066,
NGGLMDYAFE,nt,N,201,false,"Arg/N-end rule seed, prt6 vs. Wt",99,29168982,"MASCOT Score",26.0300000,,0.2520134,0.7336340,NO,0.03558000177145,-0.9510819
NGGIDTDKDYPYK,ac,K,222,true,"Quantitative Acetylproteomics",101,29440448,,,,,,,,
GVDGTCDQIRK,ox,C,233,true,"OxiTRAQ Arabidopsis - 5 mM H2O2 versus control",47,24376095,,,,0.6022026,0.0316273,NO,,
GVDGTCDQIR,ox,C,233,true,"OxiTRAQ Arabidopsis - 5 mM H2O2 versus control",47,24376095,,,,0.5767209,0.0702634,NO,,
GVDGTCDQIR,sno,C,233,true,"Endogenous S-nitrosylation in Arabidopsis",64,22115780,"MASCOT Score",59.0000000,,,,,,
GVDGTCDQIR,sno,C,233,true,"Cold stress nitrosylation - 4°C vs 22°C",65,24388526,,,,,,,,
GVDGTCDQIR,sno,C,233,true,"hot5-4 / wildtype, FAT-switch S-nitrosoproteome",169,37277371,,,,,,,,
AKVVTIDSYEDVPTYSEE,nt,A,240,true,"HUNTER N-terminome: legumain, GluC and trypsin",119,31951383,"MaxQuant score",93.0110000,,,,,,
AKVVTIDSYE,nt,A,240,false,"Arg/N-end rule seed, prt6 vs. Wt",99,29168982,"MASCOT Score",50.4300000,,-0.9651038,0.0018982,NO,1.5839999605305E-6,0.0705317
AKVVTIDSYE,nt,A,240,false,"HUNTER N-terminome: legumain, GluC and trypsin",119,31951383,"MaxQuant score",110.8700000,,,,,,
SYEDVPTYS,nt,S,247,true,"N-terminal ChaFRADIC",92,26010716,"MASCOT Score",23.7500000,,,,,0.00054490001639351,
NSWGKSWGESGYLR,ac,K,321,true,"Quantitative Acetylproteomics",101,29440448,,,,,,,,
CGIAIEPSYPIK,sno,C,342,true,"Endogenous S-nitrosylation in Arabidopsis",64,22115780,"MASCOT Score",49.0000000,,,,,,
CGIAIEPSYPIK,sno,C,342,true,"hot5-4 / wildtype, FAT-switch S-nitrosoproteome",169,37277371,,,,-0.2760308,0.1674830,NO,,
SNTCCCLFE,nt,S,384,true,"N-terminal ChaFRADIC",92,26010716,"MASCOT Score",25.8300000,,,,,0.011020000092685,
