Peptide,PTM,ModifiedAA,ModifiedPosition,PeptideUniqueToGene,ExperimentDesc,ExpID,PubmedID,ScoreType,IdentScore,LocProb,Log2FChange,PQ-val,QuantSig,PEP,MassErrorPPM
MHAKTDSEVTSLAASSPAR,nta,M,1,true,"HUNTER N-terminome: legumain, GluC and trypsin",119,31951383,"MaxQuant score",92.4920000,,,,,,
MHAKTDSEVTSLAASSPAR,nta,M,1,true,"Arabidopsis translation initiation landscape - NTA",167a,35069635,,,,,,,,
TDSEVTSLAASSPARSPR,ph,S,7,true,"Tissue atlas Arabidopsis - ProteomicsDB",114,32188942,"MaxQuant score",90.9780000,0.8005090,,,,7.1120201027952E-5,
TDSEVTSLAASSPARSPR,ph,T,10,true,"LAXIC - ABA stress",84a,23660473,XCorr,3.2400000,0.8330000,,,,2.6300000172341E-5,
TDSEVTSLAASSPARSPR,ph,T,10,true,"atm and atr DNA damage response",88,25561503,"MASCOT Score",21.0000000,1.0000000,,,,,0.1000000
TDSEVTSLAASSPARSPR,ph,S,11,true,"LAXIC - ABA stress",84a,23660473,XCorr,3.2400000,0.8330000,,,,2.6300000172341E-5,
TDSEVTSLAASSPARSPR,ph,S,11,true,"atm and atr DNA damage response",88,25561503,"MASCOT Score",21.0000000,1.0000000,,,,,0.1000000
TDSEVTSLAASSPARSPR,ph,S,15,true,"srk2dei ABA signaling phopshoproteomics",83,23572148,"MASCOT Score",55.0000000,,,,,,-0.0002000
TDSEVTSLAASSPARSPR,ph,S,15,true,"atm and atr DNA damage response",88,25561503,"MASCOT Score",37.0000000,0.9880000,,,,,0.1000000
TDSEVTSLAASSPAR,ph,S,15,true,"Tissue atlas Arabidopsis - ProteomicsDB",114,32188942,"MaxQuant score",318.1300000,0.8388940,,,,0,
TDSEVTSLAASSPARSPR,ph,S,16,true,"Mitochondrial phosphoproteome",32,19688752,"MASCOT Score",60.4300000,,,,,,-5.6277400
TDSEVTSLAASSPARSPR,ph,S,16,true,"Phytohormone-responsive phosphoproteins",34,20374526,"MASCOT Score",41.0000000,,,,,,
TDSEVTSLAASSPARSPR,ph,S,16,true,"STN8 phosphoproteome",38,21768351,"MASCOT Score",47.5400000,,,,,,
TDSEVTSLAASSPARSPR,ph,S,16,true,"srk2dei ABA signaling phopshoproteomics",83,23572148,"MASCOT Score",94.0000000,,,,,,0.0009000
TDSEVTSLAASSPARSPR,ph,S,16,true,"LAXIC - mannitol vs control",84b,23660473,XCorr,3.6800000,0.9720000,,,,1.6299999572311E-7,
TDSEVTSLAASSPARSPR,ph,S,16,true,"SnRK2 protein kinase substrates",85,23776212,XCorr,3.7451274,0.9900000,,,,0.0041215401142836,
TDSEVTSLAASSPARSPR,ph,S,16,true,"atm and atr DNA damage response",88,25561503,"MASCOT Score",37.0000000,0.9880000,,,,,0.1000000
TDSEVTSLAASSPARSPR,ph,S,16,true,"Phosphorylation tonoplast membrane fraction",107,18686298,"MASCOT Score",36.0000000,,,,,,
TDSEVTSLAASSPARSPR,ph,S,16,true,"Col-0 callus - FC Col-0 vs. Col-0 Xray",111a,31410901,,35.0800000,,0.0578177,0.0000000,NO,,0.4787922
TDSEVTSLAASSPARSPR,ph,S,16,true,"Col-0 X-ray callus - FC Col-0 vs. Col-0 Xray",111b,31410901,,35.0800000,,0.0578177,0.0000000,NO,,0.4787922
TDSEVTSLAASSPARSPR,ph,S,16,true,"atm callus - FC atm vs. atm Xray",111c,31410901,,35.0800000,,-0.4565050,0.0000000,NO,,0.4787922
TDSEVTSLAASSPARSPR,ph,S,16,true,"atm-3 X-ray callus - FC atm vs. atm Xray",111d,31410901,,35.0800000,,-0.4565050,0.0000000,NO,,0.4787922
TDSEVTSLAASSPARSPR,ph,S,16,true,"Tissue atlas Arabidopsis - ProteomicsDB",114,32188942,"MaxQuant score",314.5100000,0.9906120,,,,0,
TDSEVTSLAASSPAR,ph,S,16,true,"Chloroplast kinase substrates",60,19376835,"MASCOT Score",41.5200000,,,,,,-0.2609410
TDSEVTSLAASSPAR,ph,S,16,true,"SnRK2 protein kinase substrates",85,23776212,XCorr,3.1227903,0.9970000,,,,0.0040401602163911,
TDSEVTSLAASSPAR,ph,S,16,true,"atm and atr DNA damage response",88,25561503,"MASCOT Score",81.0000000,0.9540000,,,,,-0.2600000
TDSEVTSLAASSPAR,ph,S,16,true,"Protein sumoylation and phosphorylation cross-talk",97,28419593,,,,,,,,
TDSEVTSLAASSPAR,ph,S,16,true,"TOR Kinase and ABA Receptor",100,29290610,XCorr,4.9956527,0.9994000,,,,3.2620000922634E-8,
TDSEVTSLAASSPARSPR,ph,S,20,true,"Plasmamembrane phosphorylation",20,15308754,,,,,,,,
TDSEVTSLAASSPARSPR,ph,S,20,true,"Phosphorylation Early Elicitor Signaling",23,17317660,,,,,,,,
TDSEVTSLAASSPARSPR,ph,S,20,true,"Plasmembrane Ph Immune Responses",25,17651370,,,,,,,,
TDSEVTSLAASSPARSPR,ph,S,20,true,"Phytohormone-responsive phosphoproteins",34,20374526,"MASCOT Score",41.0000000,,,,,,
TDSEVTSLAASSPARSPR,ph,S,20,true,"STN8 phosphoproteome",38,21768351,"MASCOT Score",59.8900000,,,,,,-0.1729010
TDSEVTSLAASSPARSPR,ph,S,20,true,"Large-scale phosphorylation discovery",44,23111157,XCorr,3.7790000,,,,,,
TDSEVTSLAASSPARSPR,ph,S,20,true,"Chloroplast kinase substrates",60,19376835,"MASCOT Score",48.1600000,,,,,,0.2032960
TDSEVTSLAASSPARSPR,ph,S,20,true,"srk2dei ABA signaling phopshoproteomics",83,23572148,"MASCOT Score",94.0000000,,,,,,0.0009000
TDSEVTSLAASSPARSPR,ph,S,20,true,"LAXIC - ABA stress",84a,23660473,XCorr,2.0600000,0.7730000,,,,0.046374201774597,
TDSEVTSLAASSPARSPR,ph,S,20,true,"LAXIC - mannitol vs control",84b,23660473,XCorr,3.6800000,1.0000000,,,,1.6299999572311E-7,
TDSEVTSLAASSPARSPR,ph,S,20,true,"SnRK2 protein kinase substrates",85,23776212,XCorr,3.7451274,1.0000000,,,,0.0041215401142836,
TDSEVTSLAASSPARSPR,ph,S,20,true,"atm and atr DNA damage response",88,25561503,"MASCOT Score",54.0000000,0.9990000,,,,,-1.2900000
TDSEVTSLAASSPARSPR,ph,S,20,true,"TOR Kinase and ABA Receptor",100,29290610,XCorr,4.4509168,0.9999000,,,,1.0569999986387E-8,
TDSEVTSLAASSPARSPR,ph,S,20,true,"Phosphorylation tonoplast membrane fraction",107,18686298,"MASCOT Score",32.0000000,,,,,,
TDSEVTSLAASSPARSPR,ph,S,20,true,"Col-0 callus - FC Col-0 vs. Col-0 Xray",111a,31410901,,35.0800000,,0.0578177,0.0000000,NO,,0.4787922
TDSEVTSLAASSPARSPR,ph,S,20,true,"Col-0 X-ray callus - FC Col-0 vs. Col-0 Xray",111b,31410901,,35.0800000,,0.0578177,0.0000000,NO,,0.4787922
TDSEVTSLAASSPARSPR,ph,S,20,true,"atm callus - FC atm vs. atm Xray",111c,31410901,,35.0800000,,-0.4565050,0.0000000,NO,,0.4787922
TDSEVTSLAASSPARSPR,ph,S,20,true,"atm-3 X-ray callus - FC atm vs. atm Xray",111d,31410901,,35.0800000,,-0.4565050,0.0000000,NO,,0.4787922
TDSEVTSLAASSPARSPR,ph,S,20,true,"Tissue atlas Arabidopsis - ProteomicsDB",114,32188942,"MaxQuant score",320.2500000,0.9999990,,,,0,
RPVYYVQSPSRDSHDGEK,ph,S,30,true,"Plasmamembrane phosphorylation",20,15308754,,,,,,,,
RPVYYVQSPSRDSHDGEK,ph,S,30,true,"srk2dei ABA signaling phopshoproteomics",83,23572148,"MASCOT Score",40.0000000,,,,,,-0.0012000
RPVYYVQSPSRDSHDGEK,ph,S,30,true,"atm and atr DNA damage response",88,25561503,"MASCOT Score",20.0000000,1.0000000,,,,,-0.2000000
RPVYYVQSPSRDSHDGEK,ph,S,30,true,"TOR Kinase and ABA Receptor",100,29290610,XCorr,4.2766857,0.9720000,,,,2.6499999421503E-6,
RPVYYVQSPSR,ph,S,30,true,"Phosphorylation nuclei-enriched fractions",28,19245862,,,,,,,,
RPVYYVQSPSR,ph,S,30,true,"Phytohormone-responsive phosphoproteins",34,20374526,"MASCOT Score",41.0000000,,,,,,3.7165300
RPVYYVQSPSR,ph,S,30,true,"STN8 phosphoproteome",38,21768351,"MASCOT Score",46.5600000,,,,,,0.5727070
RPVYYVQSPSR,ph,S,30,true,"Chloroplast kinase substrates",60,19376835,"MASCOT Score",45.2400000,,,,,,-0.4107670
RPVYYVQSPSR,ph,S,30,true,"SnRK2 protein kinase substrates",85,23776212,XCorr,2.1224291,0.9540000,,,,0.023554999381304,
RPVYYVQSPSR,ph,S,30,true,"atm and atr DNA damage response",88,25561503,"MASCOT Score",39.0000000,0.9970000,,,,,-1.8300000
RPVYYVQSPSR,ph,S,30,true,"TOR Kinase and ABA Receptor",100,29290610,XCorr,3.8372173,0.9974000,,,,8.4099997366138E-7,
RPVYYVQSPSR,ph,S,30,true,"Phosphorylation tonoplast membrane fraction",107,18686298,"MASCOT Score",47.0000000,,,,,,
RPVYYVQSPSR,ph,S,30,true,"Tissue atlas Arabidopsis - ProteomicsDB",114,32188942,"MaxQuant score",198.3700000,0.9999530,,,,6.6071299581857E-19,
RPVYYVQSPSRDSHDGEK,ph,S,32,true,"Plasmamembrane phosphorylation",20,15308754,,,,,,,,
RPVYYVQSPSRDSHDGEK,ph,S,32,true,"Tissue atlas Arabidopsis - ProteomicsDB",114,32188942,"MaxQuant score",83.3100000,0.8936950,,,,4.105449988856E-5,
RPVYYVQSPSR,ph,S,32,true,"atm and atr DNA damage response",88,25561503,"MASCOT Score",42.0000000,0.9390000,,,,,-1.9000000
RPVYYVQSPSRDSHDGEK,ph,S,35,true,"Plasmamembrane phosphorylation",20,15308754,,,,,,,,
RPVYYVQSPSRDSHDGEK,ph,S,35,true,"TOR Kinase and ABA Receptor",100,29290610,XCorr,3.0106404,0.9786000,,,,0.016920000314713,
RPVYYVQSPSRDSHDGEK,ph,S,35,true,"Tissue atlas Arabidopsis - ProteomicsDB",114,32188942,"MaxQuant score",97.1240000,0.9996780,,,,1.7176099618155E-6,
TATSFHSTPVLSPMGSPPHSHSSMGR,ph,T,48,true,"Phosphorylation Early Elicitor Signaling",23,17317660,,,,,,,,
TATSFHSTPVLSPMGSPPHSHSSMGR,ph,S,52,true,"atm and atr DNA damage response",88,25561503,"MASCOT Score",28.0000000,0.9990000,,,,,-0.5300000
TATSFHSTPVLSPMGSPPHSHSSMGR,ph,S,52,true,"Tissue atlas Arabidopsis - ProteomicsDB",114,32188942,"MaxQuant score",188.9300000,1.0000000,,,,0,
TATSFHSTPVLSPMGSPPHSHSSMGR,ph,S,56,true,"Phytohormone-responsive phosphoproteins",34,20374526,"MASCOT Score",69.0000000,,,,,,-1.1656400
TATSFHSTPVLSPMGSPPHSHSSMGR,ph,S,56,true,"atm and atr DNA damage response",88,25561503,"MASCOT Score",30.0000000,1.0000000,,,,,-0.6200000
TATSFHSTPVLSPMGSPPHSHSSMGR,ph,S,56,true,"TOR Kinase and ABA Receptor",100,29290610,XCorr,5.0247583,0.9995000,,,,0.00019809999503195,
TATSFHSTPVLSPMGSPPHSHSSMGR,ph,S,56,true,"Tissue atlas Arabidopsis - ProteomicsDB",114,32188942,"MaxQuant score",188.9300000,0.9995750,,,,0,
TATSFHSTPVLSPMGSPPHSHSSMGR,ph,S,62,true,"atm and atr DNA damage response",88,25561503,"MASCOT Score",33.0000000,0.9080000,,,,,-0.7000000
FSGSLKPGSR,ph,S,77,true,"Tissue atlas Arabidopsis - ProteomicsDB",114,32188942,"MaxQuant score",127.3700000,0.9785150,,,,3.4296999018579E-8,
FSGSLKPGSR,ph,S,79,true,"TOR Kinase and ABA Receptor",100,29290610,XCorr,2.3946233,0.9794000,,,,0.021980000659823,
FSGSLKPGSR,ph,S,79,true,"Tissue atlas Arabidopsis - ProteomicsDB",114,32188942,"MaxQuant score",91.9390000,0.9996370,,,,0.0018928999779746,
FSGSLKPGSR,ub,K,81,true,"Ubiquitination Membrane Proteins",120,33585938,,,,,,,,
FSGSLKPGSR,ph,S,84,true,"atm and atr DNA damage response",88,25561503,"MASCOT Score",31.0000000,1.0000000,,,,,-0.3400000
FSGSLKPGSR,ph,S,84,true,"Tissue atlas Arabidopsis - ProteomicsDB",114,32188942,"MaxQuant score",101.7200000,0.9999360,,,,0.00071414897684008,
KVNPNDGSKR,ph,S,93,true,"Tissue atlas Arabidopsis - ProteomicsDB",114,32188942,"MaxQuant score",61.4350000,1.0000000,,,,0.0041743200272322,
KVNPNDGSK,ph,S,93,true,"atm and atr DNA damage response",88,25561503,"MASCOT Score",45.0000000,1.0000000,,,,,-4.7700000
IQAGQDAGGVGTDMITMNATLR,ng,N,189,true,"Conserved N-glycosylation",74,22633491,"MaxQuant Score",182.4400000,1.0000000,,,,0,-0.0120000
IECDINFEHK,acy,C,318,true,"Arabidopsis S-acylation atlas - Silique",163e,35681017,,,,,,,,
