Peptide,PTM,ModifiedAA,ModifiedPosition,PeptideUniqueToGene,ExperimentDesc,ExpID,PubmedID,ScoreType,IdentScore,LocProb,Log2FChange,PQ-val,QuantSig,PEP,MassErrorPPM
AGEGEVIACH,nt,A,2,true,"Arg/N-end rule seed, prt6 vs. Wt",99,29168982,"MASCOT Score",50.9800000,,,,,0.039009999483824,-0.6886326
AGEGEVIACHTLEVWNEK,nta,A,2,true,"Characterization plant N-terminal acetylation",6,22223895,"MASCOT Score",81.1100000,,,,,,
AGEGEVIACHTLEVWNEK,nta,A,2,true,"Arg/N-end rule pathway Roots",80,25728785,"MASCOT Score",72.0700000,,,,,7.1190000561216E-9,
AGEGEVIACHTLEVWN,nta,A,2,true,"HUNTER N-terminome: legumain, GluC and trypsin",119,31951383,"MaxQuant score",94.7670000,,,,,,
AGEGEVIACHTL,nta,A,2,true,"Arg/N-end rule pathway Roots",80,25728785,"MASCOT Score",45.9400000,,,,,0.013939999975264,
AGEGEVIACH,nta,A,2,true,"Arg/N-end rule pathway Roots",80,25728785,"MASCOT Score",44.0800000,,,,,4.0300001273863E-5,
AGEGEVIACH,nta,A,2,true,"Arg/N-end rule seed, prt6 vs. Wt",99,29168982,"MASCOT Score",50.9800000,,,,,0.039009999483824,-0.6886326
VVGAAKDEINEK,ub,K,101,true,"upl3 mutant / wildtype",168,35926874,"MaxQuant score",85.5540000,1.0000000,-0.6734627,0.1804980,NO,0.00047684600576758,0.0133350
