Peptide,PTM,ModifiedAA,ModifiedPosition,PeptideUniqueToGene,ExperimentDesc,ExpID,PubmedID,ScoreType,IdentScore,LocProb,Log2FChange,PQ-val,QuantSig,PEP,MassErrorPPM
LPHLLHDNDSDDWNYRPSK,ph,S,136,true,"TOR Kinase and ABA Receptor",100,29290610,XCorr,3.2389739,0.9873000,,,,0.00061930000083521,
CSLEIDYK,so,C,254,true,"S-sulfenylation site detection using YAP1C",110,32714340,,,,,,,,
CSVIAAANPVGGR,so,C,650,true,"S-sulfenylation site detection using YAP1C",110,32714340,,,,,,,,
FDILCVVK,so,C,687,true,"S-sulfenylation site detection using YAP1C",110,32714340,,,,,,,,
GGKMEDSDPEDGIQGSSGSTDPEVLPQNLLK,ph,S,722,true,"srk2dei ABA signaling phopshoproteomics",83,23572148,"MASCOT Score",33.0000000,,,,,,-0.0045000
MEDSDPEDGIQGSSGSTDPEVLPQNLLKK,ph,S,722,true,"Tissue atlas Arabidopsis - ProteomicsDB",114,32188942,"MaxQuant score",250.4800000,1.0000000,,,,0,
MEDSDPEDGIQGSSGSTDPEVLPQNLLK,ph,S,722,true,"SnRK2 protein kinase substrates",85,23776212,XCorr,4.5167093,1.0000000,,,,2.4199500330724E-5,
MEDSDPEDGIQGSSGSTDPEVLPQNLLK,ph,S,722,true,"TOR Kinase and ABA Receptor",100,29290610,XCorr,4.2113619,1.0000000,,,,0.00027610000688583,
MEDSDPEDGIQGSSGSTDPEVLPQNLLK,ph,S,722,true,"Phospho cell culture sucrose/TOR",109,30833711,,,1.0000000,,,,,
