Peptide,PTM,ModifiedAA,ModifiedPosition,PeptideUniqueToGene,ExperimentDesc,ExpID,PubmedID,ScoreType,IdentScore,LocProb,Log2FChange,PQ-val,QuantSig,PEP,MassErrorPPM
SSGQVQGQQFSNVSANQLLAEQQR,og,S,121,true,"O-GlcNac Inflorescence Tissue",81,28154133,"MASCOT Score",39.8000000,,,,,,1.2000000
GGGLAGVGPVKMEPGQVSNDQQHGQVQQQQQK,sumo,K,170,true,"SUMO Ligase SIZ1 heat stress",4,29588388,,,,,,,,
NLGSVKLEPQQIQAMR,ph,S,198,true,"Tissue atlas Arabidopsis - ProteomicsDB",114,32188942,"MaxQuant score",243.8600000,1.0000000,,,,0,
NLGSVKLEPQQIQAMR,sumo,K,200,true,"SUMO Ligase SIZ1 heat stress",4,29588388,,,,,,,,
NLAQVKMEPQHSEQSLFLQQQQR,sumo,K,216,true,"SUMO Ligase SIZ1 heat stress",4,29588388,,,,,,,,
MEPQHSEQSLFLQQQQR,og,S,222,true,"O-GlcNac Inflorescence Tissue",81,28154133,"MASCOT Score",34.7000000,,,,,,4.3000000
LLIPQVSQLGSAAQK,ph,S,475,true,"Tissue atlas Arabidopsis - ProteomicsDB",114,32188942,"MaxQuant score",74.9780000,0.9814380,,,,0.00035029198625125,
RTGPSSALPGPSPQQASDQLR,ph,S,580,true,"Tissue atlas Arabidopsis - ProteomicsDB",114,32188942,"MaxQuant score",60.4190000,0.9987900,,,,3.7229401641525E-5,
RTGPSSALPGPSPQQASDQLR,ph,S,585,true,"Tissue atlas Arabidopsis - ProteomicsDB",114,32188942,"MaxQuant score",84.8780000,0.9997330,,,,1.5491799842948E-7,
QQQQQQQQQQQQQQQQQQQQQQQQTVSQNTNSDQSSR,ph,S,616,true,"Lateral root-induction - NAA vs control",106,23328941,"MASCOT Score",60.0000000,,,,,,
QVALMQGNPSNGVNYAFNAASASTSTSSIAGLIHQNSMK,fuc,S,647,true,"SPINDLY O-fucosylation",162,36739885,,,,,,,-3,
