Peptide,PTM,ModifiedAA,ModifiedPosition,PeptideUniqueToGene,ExperimentDesc,ExpID,PubmedID,ScoreType,IdentScore,LocProb,Log2FChange,PQ-val,QuantSig,PEP,MassErrorPPM
ASNVFDHPLQE,nta,A,2,true,"HUNTER N-terminome: legumain, GluC and trypsin",119,31951383,"MaxQuant score",72.9280000,,,,,,
ASNVFDHPLQELEGEDNGVKSEK,ph,S,22,true,"Tissue atlas Arabidopsis - ProteomicsDB",114,32188942,"MaxQuant score",174.1000000,1.0000000,,,,0,
ASLLETSGSVDTTPEDSGHR,ph,S,31,true,"Tissue atlas Arabidopsis - ProteomicsDB",114,32188942,"MaxQuant score",145.6900000,0.8366780,,,,4.3675000027635E-24,
ASLLETSGSVDTTPEDSGHR,ph,S,33,true,"Tissue atlas Arabidopsis - ProteomicsDB",114,32188942,"MaxQuant score",236.4300000,0.9997940,,,,0,
ASLLETSGSVDTTPEDSGHR,ph,T,36,true,"Tissue atlas Arabidopsis - ProteomicsDB",114,32188942,"MaxQuant score",177.1200000,0.9847410,,,,1.6899500561301E-35,
GLDHCETAPVGLYGDMLINDSEIQYSR,ph,T,57,true,"Tissue atlas Arabidopsis - ProteomicsDB",114,32188942,"MaxQuant score",159.2500000,1.0000000,,,,0,
SLTEKGSPAIHNLK,ph,T,80,true,"Tissue atlas Arabidopsis - ProteomicsDB",114,32188942,"MaxQuant score",169.0600000,0.9998160,,,,5.5809597996267E-16,
GSPAIHNLK,ph,S,84,true,"Tissue atlas Arabidopsis - ProteomicsDB",114,32188942,"MaxQuant score",183.7100000,1.0000000,,,,2.0445299355622E-23,
SLTESFR,ph,S,149,true,"Tissue atlas Arabidopsis - ProteomicsDB",114,32188942,"MaxQuant score",119.6200000,0.9999930,,,,0.013406500220299,
DTEQRGIVDR,ph,T,437,true,"srk2dei ABA signaling phopshoproteomics",83,23572148,"MASCOT Score",32.0000000,,,,,,-0.0027000
KCCLPCGGV,acy,C,608,true,"Arabidopsis S-acylation atlas - Hypocotyl",163b,35681017,,,,,,,,
KCCLPCGGV,acy,C,608,true,"Arabidopsis S-acylation atlas - Leaf",163c,35681017,,,,,,,,
KCCLPCGGV,acy,C,608,true,"Arabidopsis S-acylation atlas - Silique",163e,35681017,,,,,,,,
KCCLPCGGV,acy,C,608,true,"Arabidopsis S-acylation atlas - Stem",163f,35681017,,,,,,,,
CCLPCGGV,acy,C,608,true,"Arabidopsis S-acylation atlas - Hypocotyl",163b,35681017,,,,,,,,
KCCLPCGGV,acy,C,609,true,"Arabidopsis S-acylation atlas - Hypocotyl",163b,35681017,,,,,,,,
KCCLPCGGV,acy,C,609,true,"Arabidopsis S-acylation atlas - Leaf",163c,35681017,,,,,,,,
KCCLPCGGV,acy,C,609,true,"Arabidopsis S-acylation atlas - Silique",163e,35681017,,,,,,,,
KCCLPCGGV,acy,C,609,true,"Arabidopsis S-acylation atlas - Stem",163f,35681017,,,,,,,,
CCLPCGGV,acy,C,609,true,"Arabidopsis S-acylation atlas - Hypocotyl",163b,35681017,,,,,,,,
KCCLPCGGV,acy,C,612,true,"Arabidopsis S-acylation atlas - Hypocotyl",163b,35681017,,,,,,,,
KCCLPCGGV,acy,C,612,true,"Arabidopsis S-acylation atlas - Leaf",163c,35681017,,,,,,,,
KCCLPCGGV,acy,C,612,true,"Arabidopsis S-acylation atlas - Silique",163e,35681017,,,,,,,,
KCCLPCGGV,acy,C,612,true,"Arabidopsis S-acylation atlas - Stem",163f,35681017,,,,,,,,
CCLPCGGV,acy,C,612,true,"Arabidopsis S-acylation atlas - Hypocotyl",163b,35681017,,,,,,,,
