Peptide,PTM,ModifiedAA,ModifiedPosition,PeptideUniqueToGene,ExperimentDesc,ExpID,PubmedID,ScoreType,IdentScore,LocProb,Log2FChange,PQ-val,QuantSig,PEP,MassErrorPPM
ATHAALAVSR,nt,A,2,true,"FtsH12 N-terminome: WT / FtsH12 knockdown miRNA",118,33216923,"MaxQuant score",44.3910000,,-0.5514224,0.0314190,NO,0.0097426995635033,
AVTTSTPVRGE,nt,A,67,true,"N-terminal ChaFRADIC",92,26010716,"MASCOT Score",35.9300000,,,,,0.0010959999635816,
AVTTSTPVRGE,nt,A,67,true,"Arabidopsis translation initiation landscape - NT",167b,35069635,,,,,,,,
KLKVAINGFGR,nt,K,81,false,"Stromal N-terminome",96,26371235,"MASCOT Score",37.9100000,,,,,,
KLKVAINGFGR,nt,K,81,false,"FtsH12 N-terminome: WT / FtsH12 knockdown miRNA",118,33216923,"MaxQuant score",72.6150000,,-0.1648367,0.4585532,NO,1.2900000001537E-5,
KLKVAINGFGR,nt,K,81,false,"HUNTER N-terminome: legumain, GluC and trypsin",119,31951383,"MaxQuant score",103.1800000,,,,,,
CWHGRK,so,C,99,false,"S-sulfenylation site detection using YAP1C",110,32714340,,,,,,,,
DSPLEVVVLNDSGGVK,ng,N,114,true,"N-glycan occupancy Arabidopsis glycoproteins",87,23994444,"Ladder score",52.7000000,,,,,,
DSPLEVVVLNDSGGVK,ph,S,116,true,"Tyrosine phosphorylation in Arabidopsis",59,18463617,"MASCOT Score",37.0000000,,,,,,-1.2889539
DSPLEVVVLNDSGGVK,ph,S,116,true,"srk2dei ABA signaling phopshoproteomics",83,23572148,"MASCOT Score",43.0000000,,,,,,-0.0007000
KDSPLEVVVLNDSGGVKNASHLLK,ac,K,120,true,"Quantitative Acetylproteomics",101,29440448,,,,,,,,
DSPLEVVVLNDSGGVKNASHLLK,ac,K,120,true,"Quantitative Acetylproteomics",101,29440448,,,,,,,,
NASHLLKYDSMLGTFK,ac,K,127,true,"Histone deacetylases - apicidin vs control",98a,29061669,"MaxQuant Score",158.3000000,1.0000000,0.2580000,0.2157744,NO,2.7000000916547E-34,
NASHLLKYDSMLGTFK,ac,K,127,true,"Histone deacetylases substrates - hda14 vs WT",98e,29061669,"MaxQuant Score",99.0000000,1.0000000,0.2830000,0.7603263,NO,1.4999999525017E-15,
NASHLLKYDSMLGTFK,ac,K,127,true,"Quantitative Acetylproteomics",101,29440448,,,,,,,,
YDSMLGTFK,mox,M,131,true,"cat2 Methionine oxidation - 1h stress",62a,25693801,"MASCOT Score",60.0000000,,-0.2154052,,NO,,
YDSMLGTFK,mox,M,131,true,"cat2 Methionine oxidation - 3h stress",62b,25693801,"MASCOT Score",37.0000000,,-0.1053019,,NO,,
IVDNETISVDGKLIK,ac,K,152,true,"Histone deacetylases - apicidin vs control",98a,29061669,"MaxQuant Score",134.4000000,1.0000000,0.0690000,0.7516229,NO,1.6000000269798E-15,
LIKVVSNR,ac,K,155,true,"Histone deacetylases - apicidin vs control",98a,29061669,"MaxQuant Score",121.7000000,1.0000000,0.0360000,0.8472274,NO,0.003000000026077,
HIQAGASKVIITAPAK,ph,S,197,true,"Tissue atlas Arabidopsis - ProteomicsDB",114,32188942,"MaxQuant score",49.9730000,0.9996710,,,,0.0012053799582645,
HIQAGASK,ph,S,197,true,"atm and atr DNA damage response",88,25561503,"MASCOT Score",45.0000000,1.0000000,,,,,-0.8000000
SYTGDQRLLD,nt,S,263,false,"HUNTER N-terminome: legumain, GluC and trypsin",119,31951383,"MaxQuant score",79.1480000,,,,,,
GTMTTTHSYTGDQR,ph,T,265,false,"atm and atr DNA damage response",88,25561503,"MASCOT Score",80.0000000,0.9920000,,,,,-0.5300000
GTMTTTHSYTGDQR,ph,T,265,false,"Tissue atlas Arabidopsis - ProteomicsDB",114,32188942,"MaxQuant score",88.2640000,0.9806690,,,,0.00013817500439472,
AAALNIVPTSTGAAK,ph,T,291,false,"srk2dei ABA signaling phopshoproteomics",83,23572148,"MASCOT Score",23.0000000,,,,,,0.0000000
AAALNIVPTSTGAAK,ph,S,292,false,"Tissue atlas Arabidopsis - ProteomicsDB",114,32188942,"MaxQuant score",172.5700000,0.8044420,,,,1.5605900456336E-17,
AAALNIVPTSTGAAK,ph,T,293,false,"srk2dei ABA signaling phopshoproteomics",83,23572148,"MASCOT Score",26.0000000,,,,,,0.0010000
AAALNIVPTSTGAAK,ph,T,293,false,"atm and atr DNA damage response",88,25561503,"MASCOT Score",30.0000000,1.0000000,,,,,-1.3900000
AAALNIVPTSTGAAK,ac,K,297,false,"Quantitative Acetylproteomics",101,29440448,,,,,,,,
AVSLVLPQLKGK,ac,K,307,true,"Histone deacetylases - apicidin vs control",98a,29061669,"MaxQuant Score",119.4000000,1.0000000,-0.7150000,0.5395106,NO,8.9000001812778E-11,
AVSLVLPQLKGK,ac,K,307,true,"Histone deacetylases substrates - TSA vs control",98b,29061669,"MaxQuant Score",119.4000000,1.0000000,-0.3170000,0.9977001,NO,8.9000001812778E-11,
AVSLVLPQLKGK,ac,K,307,true,"Quantitative Acetylproteomics",101,29440448,,,,,,,,
AVSLVLPQLK,ac,K,307,true,"Quantitative Acetylproteomics",101,29440448,,,,,,,,
GKLNGIALR,ac,K,309,false,"Histone deacetylases - apicidin vs control",98a,29061669,"MaxQuant Score",118.7000000,1.0000000,-0.1300000,0.5457579,NO,0.00022000000171829,
GKLNGIALR,ac,K,309,false,"Histone deacetylases- hda14 vs WT (low light)",98c,29061669,"MaxQuant Score",136.5700000,1.0000000,-0.9530000,0.9549926,NO,0.0080000003799796,
GLTAEDVNEAFR,nt,G,335,true,"Metacaspase9 substrates - in vitro rMC9",51c,23964026,"MASCOT Score",55.0000000,,,,,,-0.2157229
AANGPMK,mox,M,353,true,"cat2 Methionine oxidation - 1h stress",62a,25693801,"MASCOT Score",37.0000000,,0.0682612,,NO,,
AANGPMK,mox,M,353,true,"cat2 Methionine oxidation - 3h stress",62b,25693801,"MASCOT Score",32.0000000,,-0.1096269,,NO,,
GILDVCDAPLVSVDFR,sno,C,360,true,"Site-specific nitrosomeproteomic id - gsnor1-3",90a,25699590,XCorr,5.0554628,,,,,0.0086409999057651,-5.5627758
GILDVCDAPLVSVDFR,sno,C,360,true,"Site-specific nitrosomeproteomic id - gsnor1-3",90b,25699590,XCorr,5.0900000,,,,,0.0052609997801483,-5.5600000
GILDVCDAPLVSVDFR,sno,C,360,true,"hot5-4 / wildtype, FAT-switch S-nitrosoproteome",169,37277371,,,,-0.6886370,0.0590326,NO,,
GILDVCDAPLVSVDFR,so,C,360,true,"S-sulfenylation site detection using YAP1C",110,32714340,,,,,,,,
WPGAEAVGSGDPLEDFCK,ox,C,434,true,"SPEAR - 10 mM H2O2 / mock",138a,34619326,,,,0.6317420,0.0238958,YES,,
WPGAEAVGSGDPLEDFCK,ox,C,434,true,"SPEAR - 50 mM H2O2 / mock",138b,34619326,,,,0.8886936,0.0025431,YES,,
WPGAEAVGSGDPLEDFCK,sno,C,434,true,"Site-specific nitrosomeproteomic id - gsnor1-3",90a,25699590,XCorr,3.9039078,,,,,1.8539999473433E-6,-5.4105721
WPGAEAVGSGDPLEDFCK,sno,C,434,true,"Site-specific nitrosomeproteomic id - gsnor1-3",90b,25699590,XCorr,4.5300000,,,,,0.0076159997843206,-6.5600000
WPGAEAVGSGDPLEDFCK,sno,C,434,true,"hot5-4 / wildtype, FAT-switch S-nitrosoproteome",169,37277371,,,,0.3647247,0.0005669,NO,,
WPGAEAVGSGDPLEDFCKTNPADEECK,ac,K,435,true,"Histone deacetylases substrates - hda14 vs WT",98e,29061669,"MaxQuant Score",82.0000000,1.0000000,0.0850000,0.9705100,NO,3.7999999052584E-18,
TNPADEECKVYD,ox,C,443,true,"OxiTRAQ Arabidopsis - 5 mM H2O2 versus control",47,24376095,,,,-0.2786556,0.0362528,NO,,
TNPADEECKVYD,ox,C,443,true,"SPEAR - 10 mM H2O2 / mock",138a,34619326,,,,-1.7507408,0.0169438,YES,,
TNPADEECKVYD,ox,C,443,true,"SPEAR - 50 mM H2O2 / mock",138b,34619326,,,,1.0493790,0.0004496,YES,,
TNPADEECK,ox,C,443,true,"OxiTRAQ Arabidopsis - 5 mM H2O2 versus control",47,24376095,,,,-0.3795698,0.0123074,NO,,
TNPADEECKVYD,sno,C,443,true,"Site-specific nitrosomeproteomic id - gsnor1-3",90b,25699590,XCorr,2.5552785,,,,,0.13410000503063,-6.9074862
TNPADEECKVYD,sno,C,443,true,"S-Nitroso-Proteome guard cells - 60 min flg22",116c,32121556,,,,-0.3400754,0.0310000,YES,,
TNPADEECKVYD,ac,K,444,true,"Histone deacetylases substrates - hda14 vs WT",98e,29061669,"MaxQuant Score",43.8000000,1.0000000,0.4410000,0.8912509,NO,0.0060000000521541,
TNPADEECKVYD,ph,Y,446,true,"Tissue atlas Arabidopsis - ProteomicsDB",114,32188942,"MaxQuant score",110.3900000,1.0000000,,,,0.00053638900863007,
