Peptide,PTM,ModifiedAA,ModifiedPosition,PeptideUniqueToGene,ExperimentDesc,ExpID,PubmedID,ScoreType,IdentScore,LocProb,Log2FChange,PQ-val,QuantSig,PEP,MassErrorPPM
AGSVNGNHSAVGPGINYE,nt,A,2,true,"Arg/N-end rule seed, prt6 vs. Wt",99,29168982,"MASCOT Score",32.8900000,,,,,0.0144800003618,-1.0757505
AGSVNGNHSAVGPGINYETVSQVDEFCKALR,nta,A,2,true,"FtsH12 N-terminome: WT / FtsH12 knockdown miRNA",118,33216923,"MaxQuant score",98.0330000,,,,,2.5100000129896E-5,
AGSVNGNHSAVGPGINYETVSQVDEFCKALR,nta,A,2,true,"HUNTER N-terminome: legumain, GluC and trypsin",119,31951383,"MaxQuant score",137.6400000,,,,,,
AGSVNGNHSAVGPGINYE,nta,A,2,true,"Arg/N-end rule seed, prt6 vs. Wt",99,29168982,"MASCOT Score",32.8900000,,,,,0.0144800003618,-1.0757505
AGSVNGNHSAVGPGINYE,nta,A,2,true,"HUNTER N-terminome: legumain, GluC and trypsin",119,31951383,"MaxQuant score",96.8660000,,,,,,
AGSVNGNHSAVGPGINYE,nta,A,2,true,"Arabidopsis translation initiation landscape - NTA",167a,35069635,,,,,,,,
DCSVQR,sno,C,292,false,"hot5-4 / wildtype, FAT-switch S-nitrosoproteome",169,37277371,,,,,,,,
TCLLQNDHDPSK,sno,C,668,false,"Site-specific nitrosomeproteomic id - gsnor1-3",90a,25699590,XCorr,2.4714715,,,,,0.0030960000585765,-5.5501843
TCLLQNDHDPSK,so,C,668,false,"Arabidopsis S-sulfenylation chemoproteomics",108,31578252,"pFind PSM Score",0.0240755,,1.1904800,,,,0.7753935
CAATLNAAR,ox,C,778,false,"OxiTRAQ Arabidopsis - 5 mM H2O2 versus control",47,24376095,,,,1.4193202,0.0081940,YES,,
GILEAHLSSCDEKER,ox,C,871,false,"SPEAR - 10 mM H2O2 / mock",138a,34619326,,,,2.1108027,0.0074309,YES,,
GILEAHLSSCDEKER,ox,C,871,false,"SPEAR - 50 mM H2O2 / mock",138b,34619326,,,,2.6089603,0.0006074,YES,,
GILEAHLSSCDEK,sno,C,871,false,"Site-specific nitrosomeproteomic id - gsnor1-3",90a,25699590,XCorr,2.4403183,,,,,5.9620000683935E-5,-6.0362185
GILEAHLSSCDEK,sno,C,871,false,"Site-specific nitrosomeproteomic id - gsnor1-3",90b,25699590,XCorr,2.7600000,,,,,0.055210001766682,-6.5000000
GILEAHLSSCDEK,sno,C,871,false,"hot5-4 / wildtype, FAT-switch S-nitrosoproteome",169,37277371,,,,,,,,
LSELRSNIAR,ph,S,1010,true,"Tissue atlas Arabidopsis - ProteomicsDB",114,32188942,"MaxQuant score",66.3930000,0.9994380,,,,0.0022838800214231,
SLSELEMFTEDGENMDTPKR,ph,T,1031,true,"Tissue atlas Arabidopsis - ProteomicsDB",114,32188942,"MaxQuant score",282.2000000,1.0000000,,,,0,
SLSELEMFTEDGENMDTPK,ph,T,1031,true,"Chloroplast kinase substrates",60,19376835,"MASCOT Score",51.6800000,,,,,,0.2479710
SLSELEMFTEDGENMDTPK,ph,T,1031,true,"srk2dei ABA signaling phopshoproteomics",83,23572148,"MASCOT Score",53.0000000,,,,,,0.0028000
SLSELEMFTEDGENMDTPK,ph,T,1031,true,"SnRK2 protein kinase substrates",85,23776212,XCorr,3.2286990,1.0000000,,,,7.1143801960716E-10,
SLSELEMFTEDGENMDTPK,ph,T,1031,true,"TOR Kinase and ABA Receptor",100,29290610,XCorr,4.9613638,1.0000000,,,,1.8990000683061E-8,
SLSELEMFTEDGENMDTPK,ph,T,1031,true,"Lateral root-induction - NAA vs control",106,23328941,"MASCOT Score",78.0000000,,0.0893922,0.7768450,NO,,
QATMNDGFILQQGQDK,ph,T,1315,true,"Tissue atlas Arabidopsis - ProteomicsDB",114,32188942,"MaxQuant score",162.1400000,1.0000000,,,,1.5155399450597E-13,
LDQKLISLK,ac,K,2057,true,"Quantitative Acetylproteomics",101,29440448,,,,,,,,
LIQDWFCNSDIAK,ox,C,2170,true,"SPEAR - 50 mM H2O2 / mock",138b,34619326,,,,3.2652558,0.0006649,YES,,
