Peptide,PTM,ModifiedAA,ModifiedPosition,PeptideUniqueToGene,ExperimentDesc,ExpID,PubmedID,ScoreType,IdentScore,LocProb,Log2FChange,PQ-val,QuantSig,PEP,MassErrorPPM
AGILNKLRNL,nt,A,2,true,"N-term acetylation drought responses",5,26184543,,,,,,,,
AGILNKLRNLDAYPKINE,nta,A,2,true,"Arabidopsis translation initiation landscape - NTA",167a,35069635,,,,,,,,
AGILNKLRNL,nta,A,2,true,"N-term acetylation drought responses",5,26184543,,,,,,,,
AGILNKLR,nta,A,2,true,"Arg/N-end rule pathway Roots",80,25728785,"MASCOT Score",34.6500000,,,,,0.080820001661777,
AGILNK,nta,A,2,true,"Characterization plant N-terminal acetylation",6,22223895,"MASCOT Score",39.0700000,,,,,,
LDSNGNTIEARQDGIGATK,ph,S,111,true,"Tyrosine phosphorylation in Arabidopsis",59,18463617,"MASCOT Score",25.0000000,,,,,,-2.5013157
LGHNETYCGSCYGAEAEEHDCCNSCEDVR,ng,N,142,true,"Conserved N-glycosylation",74,22633491,"MaxQuant Score",301.3400000,1.0000000,,,,0,0.6800000
GWGVTNPDLIDQCK,sno,C,186,true,"hot5-4 / wildtype, FAT-switch S-nitrosoproteome",169,37277371,,,,0.6277820,0.0006779,YES,,
SFNISHK,ph,S,243,false,"Tissue atlas Arabidopsis - ProteomicsDB",114,32188942,"MaxQuant score",121.6400000,1.0000000,,,,0.012279300019145,
DSFNISHK,ng,N,245,true,"Conserved N-glycosylation",74,22633491,"MaxQuant Score",64.7510000,1.0000000,,,,0.054999999701977,0.2560000
DSFNISHK,ng,N,245,true,"UDP-GlcNAc transporter glycopeptide analysis",135,30224661,,,,,,,0.0011768956901506,0.4000000
