Peptide,PTM,ModifiedAA,ModifiedPosition,PeptideUniqueToGene,ExperimentDesc,ExpID,PubmedID,ScoreType,IdentScore,LocProb,Log2FChange,PQ-val,QuantSig,PEP,MassErrorPPM
METKPNPRRP,nta,M,1,true,"N-term acetylation drought responses",5,26184543,,,,,,,,
METKPNPR,nta,M,1,true,"Arg/N-end rule pathway Roots",80,25728785,"MASCOT Score",37.4100000,,,,,0.039129998534918,
METKPNPR,nta,M,1,true,"Arabidopsis translation initiation landscape - NTA",167a,35069635,,,,,,,,
METKPNPR,ph,T,3,true,"Tissue atlas Arabidopsis - ProteomicsDB",114,32188942,"MaxQuant score",91.0950000,1.0000000,,,,0.0026719900779426,
METKPNPR,ub,K,4,true,"Arabidopsis ubiquitination COFRADIC",40,26744219,"MaxQuant Score",58.9810000,1.0000000,,,,0.0070000002160668,-2.0870000
RPSNTVLPYQTPR,ph,S,11,true,"Tissue atlas Arabidopsis - ProteomicsDB",114,32188942,"MaxQuant score",177.7400000,0.9999480,,,,6.5018298662077E-18,
STSANYACK,ox,C,54,true,"OxiTRAQ Arabidopsis - 5 mM H2O2 versus control",47,24376095,,,,-0.0790472,0.5938775,NO,,
STSANYACK,so,C,54,true,"Arabidopsis S-sulfenylation chemoproteomics",108,31578252,"pFind PSM Score",0.2559150,,1.0309300,,,,-1.5921808
LVCREDYEDVWR,so,C,64,false,"S-sulfenylation site detection using YAP1C",110,32714340,,,,,,,,
TILGVVEACHSLGVMHR,so,C,141,false,"Arabidopsis S-sulfenylation chemoproteomics",108,31578252,"pFind PSM Score",0.1612130,,2.7777800,,,,-1.3315195
TESGIFR,ph,S,232,false,"Arabidopsis root NAA phosphoproteome",18a,27643528,"MaxQuant Score",53.9680000,0.9990000,,,,0.0080000003799796,-0.8510000
TESGIFR,ph,S,232,false,"Phosphorylation Early Elicitor Signaling",23,17317660,,,,,,,,
TESGIFR,ph,S,232,false,"Plasmembrane Ph Immune Responses",25,17651370,,,,,,,,
TESGIFR,ph,S,232,false,"srk2dei ABA signaling phopshoproteomics",83,23572148,"MASCOT Score",47.0000000,,,,,,-0.0001000
TESGIFR,ph,S,232,false,"Phospho cell culture sucrose/TOR",109,30833711,,,0.9999660,,,,,
TESGIFR,ph,S,232,false,"Tissue atlas Arabidopsis - ProteomicsDB",114,32188942,"MaxQuant score",194.2900000,1.0000000,,,,6.5661898140945E-9,
RVGSELMESEIK,ph,S,361,false,"atm and atr DNA damage response",88,25561503,"MASCOT Score",38.0000000,1.0000000,,,,,-1.6500000
VGSELMESEIK,ph,S,361,false,"Phospho cell culture sucrose/TOR",109,30833711,,,0.9994730,,,,,
VGSELMESEIK,ph,S,361,false,"Tissue atlas Arabidopsis - ProteomicsDB",114,32188942,"MaxQuant score",228.9300000,1.0000000,,,,5.4552549216165E-42,
NLNFNIADAFGVDGEKSDD,ph,S,493,true,"Pollen phosphoproteome Arabidopsis",43,22631563,"MASCOT Score",66.3200000,,,,,,
NLNFNIADAFGVDGEKSDD,ph,S,493,true,"Tyrosine phosphorylation in Arabidopsis",59,18463617,"MASCOT Score",61.0000000,,,,,,-0.8491080
NLNFNIADAFGVDGEKSDD,ph,S,493,true,"srk2dei ABA signaling phopshoproteomics",83,23572148,"MASCOT Score",49.0000000,,,,,,-0.0014000
NLNFNIADAFGVDGEKSDD,ph,S,493,true,"Brassinosteroid-Regulated Phosphorylation Dynamics",94,26187819,"MaxQuant Score",191.2000000,1.0000000,,,,0,-4.9020000
NLNFNIADAFGVDGEKSDD,ph,S,493,true,"Tissue atlas Arabidopsis - ProteomicsDB",114,32188942,"MaxQuant score",61.0380000,1.0000000,,,,0.0011804000241682,
