Peptide,PTM,ModifiedAA,ModifiedPosition,PeptideUniqueToGene,ExperimentDesc,ExpID,PubmedID,ScoreType,IdentScore,LocProb,Log2FChange,PQ-val,QuantSig,PEP,MassErrorPPM
IREIFMPALSSTMTEGK,mox,M,44,false,"cat2 Methionine oxidation - 3h stress",62b,25693801,"MASCOT Score",38.0000000,,0.1603145,,NO,,
IREIFMPALSSTMTEGK,mox,M,51,false,"cat2 Methionine oxidation - 3h stress",62b,25693801,"MASCOT Score",38.0000000,,0.1603145,,NO,,
IVSWVKSEGDK,ac,K,61,true,"Quantitative Acetylproteomics",101,29440448,,,,,,,,
SEGDKLNK,ac,K,66,true,"Histone deacetylases - apicidin vs control",98a,29061669,"MaxQuant Score",128.9000000,1.0000000,-0.3290000,0.3258367,NO,0.0020000000949949,
SEGDKLNK,ac,K,66,true,"Histone deacetylases- hda14 vs WT (low light)",98c,29061669,"MaxQuant Score",153.2400000,1.0000000,2.6190000,0.9885531,NO,0.013000000268221,
SEGDKLNK,ac,K,66,true,"Histone deacetylases substrates - hda14 vs WT",98e,29061669,"MaxQuant Score",60.9000000,1.0000000,0.5390000,0.4720630,NO,0.01799999922514,
SEGDKLNK,ac,K,66,true,"Quantitative Acetylproteomics",101,29440448,,,,,,,,
APPASPPTAAVEAPVSVEK,ph,S,142,true,"Tissue atlas Arabidopsis - ProteomicsDB",114,32188942,"MaxQuant score",163.1100000,0.9995020,,,,1.570079957081E-22,
APPASPPTAAVEAPVSVEKK,ac,K,156,true,"Histone deacetylases - hda14 vs WT (thylakoids)",98d,29061669,"MaxQuant Score",129.1000000,1.0000000,4.2350000,0.0769130,NO,5.4900001488951E-21,
VAAAPVSIK,ph,S,164,true,"Tissue atlas Arabidopsis - ProteomicsDB",114,32188942,"MaxQuant score",67.2140000,1.0000000,,,,0.013449599966407,
AVAASAVHPASEGGKR,ac,K,181,true,"Quantitative Acetylproteomics",101,29440448,,,,,,,,
IVASPYAKK,ac,K,190,true,"Histone deacetylases- hda14 vs WT (low light)",98c,29061669,"MaxQuant Score",79.9900000,1.0000000,4.6170000,0.0891251,NO,0.0489999987185,
ELKVELAGLVGSGPMGR,ac,K,197,true,"Histone deacetylases substrates - hda14 vs WT",98e,29061669,"MaxQuant Score",57.5000000,1.0000000,3.4190000,0.3698282,NO,2.5999999706983E-5,
VGYTISTDALDALYKK,ac,K,285,true,"Histone deacetylases - apicidin vs control",98a,29061669,"MaxQuant Score",126.7000000,1.0000000,-0.4700000,0.3845918,NO,7.4997493810664E-42,
VGYTISTDALDALYKK,ac,K,285,true,"Histone deacetylases substrates - TSA vs control",98b,29061669,"MaxQuant Score",126.7000000,1.0000000,0.3660000,0.9794900,NO,7.4997493810664E-42,
VGYTISTDALDALYKK,ac,K,285,true,"Histone deacetylases- hda14 vs WT (low light)",98c,29061669,"MaxQuant Score",197.8800000,1.0000000,-0.5810000,0.9885531,NO,9.6999996275521E-18,
VGYTISTDALDALYKK,ac,K,285,true,"Histone deacetylases substrates - hda14 vs WT",98e,29061669,"MaxQuant Score",185.3000000,1.0000000,-0.2310000,0.9099133,NO,0,
GVTMTALLAK,mox,M,294,false,"cat2 Methionine oxidation - 1h stress",62a,25693801,"MASCOT Score",34.0000000,,0.6748115,,NO,,
GVTMTALLAK,ph,T,295,false,"Tissue atlas Arabidopsis - ProteomicsDB",114,32188942,"MaxQuant score",141.8900000,0.9949880,,,,4.5126098484616E-6,
HPVVNSSCR,so,C,316,true,"Arabidopsis S-sulfenylation chemoproteomics",108,31578252,"pFind PSM Score",0.0101534,,0.9934400,,,,0.1307433
KWKELVDK,ac,K,361,true,"Histone deacetylases- hda14 vs WT (low light)",98c,29061669,"MaxQuant Score",88.5000000,0.9970000,0.7760000,0.9885531,NO,0.01799999922514,
ELVDKAR,ac,K,366,true,"Histone deacetylases substrates - hda14 vs WT",98e,29061669,"MaxQuant Score",86.8000000,1.0000000,0.1120000,0.8912509,NO,0.019999999552965,
ELVDKAR,ac,K,366,true,"Quantitative Acetylproteomics",101,29440448,,,,,,,,
DGRIGMK,mox,M,426,true,"cat2 Methionine oxidation - 3h stress",62b,25693801,"MASCOT Score",36.0000000,,-0.1802267,,NO,,
