Peptide,PTM,ModifiedAA,ModifiedPosition,PeptideUniqueToGene,ExperimentDesc,ExpID,PubmedID,ScoreType,IdentScore,LocProb,Log2FChange,PQ-val,QuantSig,PEP,MassErrorPPM
SLSGECSVDGNSCDR,ph,S,15,true,"Tissue atlas Arabidopsis - ProteomicsDB",114,32188942,"MaxQuant score",204.5200000,0.9999810,,,,4.2038953929745E-45,
SLSGECSVDGNSCDR,ph,S,24,true,"Tissue atlas Arabidopsis - ProteomicsDB",114,32188942,"MaxQuant score",173.5100000,1.0000000,,,,4.6582601749669E-18,
SMPSDILDILDEK,ph,S,59,true,"SnRK2 protein kinase substrates",85,23776212,XCorr,2.9832480,1.0000000,,,,2.3713199936992E-7,
SMPSDILDILDEK,ph,S,59,true,"atm and atr DNA damage response",88,25561503,"MASCOT Score",43.0000000,0.9540000,,,,,-0.6900000
SMPSDILDILDEK,ph,S,59,true,"Tissue atlas Arabidopsis - ProteomicsDB",114,32188942,"MaxQuant score",86.4980000,0.9993000,,,,0.00015188900579233,
SKENSVENVQFLSDR,ph,S,84,true,"STN8 phosphoproteome",38,21768351,"MASCOT Score",49.3700000,,,,,,-0.6924900
SKENSVENVQFLSDR,ph,S,84,true,"Tissue atlas Arabidopsis - ProteomicsDB",114,32188942,"MaxQuant score",305.6300000,1.0000000,,,,0,
ENSVENVQFLSDR,ph,S,84,true,"STN8 phosphoproteome",38,21768351,"MASCOT Score",71.7800000,,,,,,-0.6165430
ENSVENVQFLSDR,ph,S,84,true,"srk2dei ABA signaling phopshoproteomics",83,23572148,"MASCOT Score",70.0000000,,,,,,0.0002000
ASLLGELSDESSEKR,ph,S,135,true,"Tissue atlas Arabidopsis - ProteomicsDB",114,32188942,"MaxQuant score",140.9600000,0.9935360,,,,1.3257399735303E-12,
ASLLGELSDESSEK,ph,S,135,true,"Tyrosine phosphorylation in Arabidopsis",59,18463617,"MASCOT Score",27.0000000,,,,,,-1.2308382
EATSCVVEIENFSPSPSPR,ph,S,451,true,"Tissue atlas Arabidopsis - ProteomicsDB",114,32188942,"MaxQuant score",230.2700000,0.9703380,,,,0,
VSDSGSNGGIDTPLVEHK,ph,S,935,true,"Tissue atlas Arabidopsis - ProteomicsDB",114,32188942,"MaxQuant score",85.9350000,0.9193750,,,,9.3121198005974E-5,
CIHGSLQGFLDNNQDSK,ph,S,1130,true,"Tissue atlas Arabidopsis - ProteomicsDB",114,32188942,"MaxQuant score",193.4200000,1.0000000,,,,4.020379944788E-39,
