Peptide,PTM,ModifiedAA,ModifiedPosition,PeptideUniqueToGene,ExperimentDesc,ExpID,PubmedID,ScoreType,IdentScore,LocProb,Log2FChange,PQ-val,QuantSig,PEP,MassErrorPPM
SQEFDPISSGVTNPR,ph,S,60,true,"STN8 phosphoproteome",38,21768351,"MASCOT Score",97.4500000,,,,,,-1.4534900
SQEFDPISSGVTNPR,ph,S,60,true,"Chloroplast kinase substrates",60,19376835,"MASCOT Score",92.8500000,,,,,,-1.4534900
SQEFDPISSGVTNPR,ph,S,60,true,"Col-0 callus - FC Col-0 vs. Col-0 Xray",111a,31410901,,77.2500000,,0.4468203,0.0000000,NO,,1.3322696
SQEFDPISSGVTNPR,ph,S,60,true,"Col-0 X-ray callus - FC Col-0 vs. Col-0 Xray",111b,31410901,,77.2500000,,0.4468203,0.0000000,NO,,1.3322696
SQEFDPISSGVTNPR,ph,S,60,true,"atm callus - FC atm vs. atm Xray",111c,31410901,,77.2500000,,0.3255525,0.0000000,NO,,1.3322696
SQEFDPISSGVTNPR,ph,S,60,true,"atm-3 X-ray callus - FC atm vs. atm Xray",111d,31410901,,77.2500000,,0.3255525,0.0000000,NO,,1.3322696
SQEFDPISSGVTNPR,ph,S,60,true,"Tissue atlas Arabidopsis - ProteomicsDB",114,32188942,"MaxQuant score",200.5800000,1.0000000,,,,3.4038599932078E-35,
RNSETFR,ph,S,88,true,"TOR Kinase and ABA Receptor",100,29290610,XCorr,2.8124292,0.9999000,,,,0.0028270001057535,
RNSETFR,ph,S,88,true,"Tissue atlas Arabidopsis - ProteomicsDB",114,32188942,"MaxQuant score",112.3000000,0.9997560,,,,0.01656880043447,
SHSDPPSPSKFK,ph,S,183,true,"Tissue atlas Arabidopsis - ProteomicsDB",114,32188942,"MaxQuant score",83.6920000,0.9879900,,,,0.0002636180142872,
SHSDPPSPSK,ph,S,183,true,"atm and atr DNA damage response",88,25561503,"MASCOT Score",35.0000000,1.0000000,,,,,0.8100000
IKSHSDPPSPSK,ph,S,187,true,"Tissue atlas Arabidopsis - ProteomicsDB",114,32188942,"MaxQuant score",83.6920000,0.9798530,,,,0.00054391997400671,
SHSDPPSPSK,ph,S,187,true,"atm and atr DNA damage response",88,25561503,"MASCOT Score",35.0000000,1.0000000,,,,,0.8100000
QFSTPNTPDR,ph,S,266,true,"atm and atr DNA damage response",88,25561503,"MASCOT Score",29.0000000,1.0000000,,,,,-0.7200000
QFSTPNTPDR,ph,S,266,true,"Tissue atlas Arabidopsis - ProteomicsDB",114,32188942,"MaxQuant score",137.0100000,0.9993510,,,,1.2987299669476E-5,
QFSTPNTPDR,ph,T,267,true,"Tissue atlas Arabidopsis - ProteomicsDB",114,32188942,"MaxQuant score",89.9000000,0.9511680,,,,0.0016659699613228,
QFSTPNTPDR,ph,T,270,true,"atm and atr DNA damage response",88,25561503,"MASCOT Score",29.0000000,1.0000000,,,,,-0.7200000
QFSTPNTPDR,ph,T,270,true,"Tissue atlas Arabidopsis - ProteomicsDB",114,32188942,"MaxQuant score",135.1000000,0.9999850,,,,4.7836700105108E-5,
SLSMQINSDSK,ph,S,276,true,"atm and atr DNA damage response",88,25561503,"MASCOT Score",37.0000000,1.0000000,,,,,1.1100000
SLSMQINSDSK,ph,S,276,true,"Tissue atlas Arabidopsis - ProteomicsDB",114,32188942,"MaxQuant score",182.3700000,0.9999970,,,,3.9368698866215E-14,
