Peptide,PTM,ModifiedAA,ModifiedPosition,PeptideUniqueToGene,ExperimentDesc,ExpID,PubmedID,ScoreType,IdentScore,LocProb,Log2FChange,PQ-val,QuantSig,PEP,MassErrorPPM
SQTEGPLR,nt,S,44,true,"Arg/N-end rule seed, prt6 vs. Wt",99,29168982,"MASCOT Score",33.1000000,,-1.4682139,0.0004282,YES,0.17470000684261,-0.5035756
SQTEGPLR,nt,S,44,true,"FtsH12 N-terminome: WT / FtsH12 knockdown miRNA",118,33216923,"MaxQuant score",167.5600000,,,,,1.4012984643248E-45,
RPSAPPTLR,ph,S,54,true,"atm and atr DNA damage response",88,25561503,"MASCOT Score",35.0000000,1.0000000,,,,,0.8500000
ELQEYFKQK,ac,K,110,true,"Histone deacetylases substrates - TSA vs control",98b,29061669,"MaxQuant Score",66.1000000,1.0000000,0.2230000,0.9794900,NO,0.014999999664724,
ELQEYFKQK,ac,K,110,true,"Histone deacetylases - hda14 vs WT (thylakoids)",98d,29061669,"MaxQuant Score",127.8000000,1.0000000,-0.0450000,0.9954054,NO,3.8400001358241E-5,
ELQEYFKQK,ac,K,110,true,"Histone deacetylases substrates - hda14 vs WT",98e,29061669,"MaxQuant Score",40.5000000,1.0000000,0.1710000,0.9099133,NO,0.029999999329448,
ELQEYFKQK,ac,K,110,true,"Quantitative Acetylproteomics",101,29440448,,,,,,,,
KLEAAGQGPFFGFQPKNEISNGR,ac,K,128,true,"Quantitative Acetylproteomics",101,29440448,,,,,,,,
