Peptide,PTM,ModifiedAA,ModifiedPosition,PeptideUniqueToGene,ExperimentDesc,ExpID,PubmedID,ScoreType,IdentScore,LocProb,Log2FChange,PQ-val,QuantSig,PEP,MassErrorPPM
RALSMAIHQAQLSQR,ph,S,46,true,"Large-scale phosphorylation discovery",44,23111157,XCorr,4.2030000,,,,,,
RALSMAIHQAQLSQR,ph,S,46,true,"atm and atr DNA damage response",88,25561503,"MASCOT Score",47.0000000,1.0000000,,,,,-0.2200000
RALSMAIHQAQLSQR,ph,S,46,true,"TOR Kinase and ABA Receptor",100,29290610,XCorr,3.2586415,1.0000000,,,,0.02225000038743,
RALSMAIHQAQLSQR,ph,S,46,true,"Tissue atlas Arabidopsis - ProteomicsDB",114,32188942,"MaxQuant score",205.7800000,1.0000000,,,,1.1350517561031E-42,
ALSMAIHQAQLSQR,ph,S,46,true,"atm and atr DNA damage response",88,25561503,"MASCOT Score",58.0000000,1.0000000,,,,,-0.1400000
ALSMAIHQAQLSQR,ph,S,46,true,"TOR Kinase and ABA Receptor",100,29290610,XCorr,4.3736763,1.0000000,,,,1.9099999803984E-7,
RALSMAIHQAQLSQR,ph,S,55,true,"Large-scale phosphorylation discovery",44,23111157,XCorr,4.2030000,,,,,,
RALSMAIHQAQLSQR,ph,S,55,true,"atm and atr DNA damage response",88,25561503,"MASCOT Score",47.0000000,1.0000000,,,,,-0.2200000
RALSMAIHQAQLSQR,ph,S,55,true,"TOR Kinase and ABA Receptor",100,29290610,XCorr,3.2586415,1.0000000,,,,0.02225000038743,
RALSMAIHQAQLSQR,ph,S,55,true,"Tissue atlas Arabidopsis - ProteomicsDB",114,32188942,"MaxQuant score",264.1600000,1.0000000,,,,0,
ALSMAIHQAQLSQR,ph,S,55,true,"Phosphoproteome iron-deficient Arabidopsis roots",41,22438062,"MASCOT Score",47.6300000,,,,,,
ALSMAIHQAQLSQR,ph,S,55,true,"Large-scale phosphorylation discovery",44,23111157,XCorr,4.5730000,,,,,,
ALSMAIHQAQLSQR,ph,S,55,true,"atm and atr DNA damage response",88,25561503,"MASCOT Score",62.0000000,1.0000000,,,,,0.4800000
ALSMAIHQAQLSQR,ph,S,55,true,"TOR Kinase and ABA Receptor",100,29290610,XCorr,3.9400055,1.0000000,,,,0.0076270001009107,
ALSMAIHQAQLSQR,ph,S,55,true,"Touch-induced phosphorylation: 40s touch vs untouc",136,30291188,"MASCOT score",110.7400000,,0.3166922,0.6532850,NO,,1.5517216
FDGSMSR,ph,S,61,false,"Tissue atlas Arabidopsis - ProteomicsDB",114,32188942,"MaxQuant score",85.7330000,0.9982850,,,,0.012373199686408,
FDGSMSR,ph,S,63,false,"TOR Kinase and ABA Receptor",100,29290610,XCorr,2.3323174,0.9073000,,,,0.087219998240471,
FDGSMSR,ph,S,63,false,"Tissue atlas Arabidopsis - ProteomicsDB",114,32188942,"MaxQuant score",109.8800000,0.9976370,,,,0.012373199686408,
RTLSDPFSNGK,ph,S,77,true,"srk2dei ABA signaling phopshoproteomics",83,23572148,"MASCOT Score",38.0000000,,,,,,0.0000000
RTLSDPFSNGK,ph,S,77,true,"atm and atr DNA damage response",88,25561503,"MASCOT Score",38.0000000,0.9990000,,,,,-1.0700000
RTLSDPFSNGK,ph,S,77,true,"TOR Kinase and ABA Receptor",100,29290610,XCorr,3.6606774,0.8562000,,,,0.0030360000673681,
TLSDPFSNGK,ph,S,77,true,"Plasmamembrane phosphorylation",20,15308754,,,,,,,,
TLSDPFSNGK,ph,S,77,true,"Phosphorylation nuclei-enriched fractions",28,19245862,,,,,,,,
TLSDPFSNGK,ph,S,77,true,"Ethylene-regulated phosphorylation ein2 mutant",30,19253305,"MASCOT Score",29.8246000,,,,,,20.9053700
TLSDPFSNGK,ph,S,77,true,"STN8 phosphoproteome",38,21768351,"MASCOT Score",51.5500000,,,,,,0.2465060
TLSDPFSNGK,ph,S,77,true,"Phosphoproteome ethylene-regulated time response",46,24043427,"MASCOT Score",57.8100000,,,,,,-7.8670000
TLSDPFSNGK,ph,S,77,true,"Tyrosine phosphorylation in Arabidopsis",59,18463617,"MASCOT Score",21.0000000,,,,,,-0.5242558
TLSDPFSNGK,ph,S,77,true,"Chloroplast kinase substrates",60,19376835,"MASCOT Score",45.9600000,,,,,,0.6128400
TLSDPFSNGK,ph,S,77,true,"Conserved plant phosphoproteome - Arabidopsis",61a,20466843,"MASCOT Score",21.0000000,1.0000000,,,,,
TLSDPFSNGK,ph,S,77,true,"BSK8 and BSL2 regulating sucrose-ph synthase",66,24924143,"MaxQuant Score",119.7400000,,,,,,1.0884000
TLSDPFSNGK,ph,S,77,true,"srk2dei ABA signaling phopshoproteomics",83,23572148,"MASCOT Score",26.0000000,,,,,,-0.0008000
TLSDPFSNGK,ph,S,77,true,"LAXIC - ABA stress",84a,23660473,XCorr,2.9500000,0.9970000,,,,0.003291160101071,
TLSDPFSNGK,ph,S,77,true,"LAXIC - mannitol vs control",84b,23660473,XCorr,2.7200000,0.9870000,,,,0.06397569924593,
TLSDPFSNGK,ph,S,77,true,"SnRK2 protein kinase substrates",85,23776212,XCorr,3.2545626,0.9980000,,,,0.057626698166132,
TLSDPFSNGK,ph,S,77,true,"SIRK1 phosphorylation",86a,23820729,"MaxQuant Score",140.8300000,1.0000000,,,,0.0089999996125698,8.3510000
TLSDPFSNGK,ph,S,77,true,"SIRK1 exp - sirk1 mutant vs WT",86b,23820729,,,,-1.0151636,,NO,,
TLSDPFSNGK,ph,S,77,true,"SIRK1 exp - 35S:SIRK1 vs WT",86c,23820729,,,,-0.9939894,,NO,,
TLSDPFSNGK,ph,S,77,true,"atm and atr DNA damage response",88,25561503,"MASCOT Score",54.0000000,1.0000000,,,,,-0.9700000
TLSDPFSNGK,ph,S,77,true,"TOR Kinase and ABA Receptor",100,29290610,XCorr,2.8370404,0.9983000,,,,0.11219999939203,
TLSDPFSNGK,ph,S,77,true,"Phospho cell culture sucrose/TOR",109,30833711,,,0.9916640,,,,,
TLSDPFSNGK,ph,S,77,true,"Col-0 callus - FC Col-0 vs. Col-0 Xray",111a,31410901,,44.7100000,,0.1647493,0.0000000,NO,,0.3691884
TLSDPFSNGK,ph,S,77,true,"Col-0 X-ray callus - FC Col-0 vs. Col-0 Xray",111b,31410901,,44.7100000,,0.1647493,0.0000000,NO,,0.3691884
TLSDPFSNGK,ph,S,77,true,"atm callus - FC atm vs. atm Xray",111c,31410901,,44.7100000,,0.3538881,0.0000000,NO,,0.3691884
TLSDPFSNGK,ph,S,77,true,"atm-3 X-ray callus - FC atm vs. atm Xray",111d,31410901,,44.7100000,,0.3538881,0.0000000,NO,,0.3691884
TLSDPFSNGK,ph,S,77,true,"Tissue atlas Arabidopsis - ProteomicsDB",114,32188942,"MaxQuant score",280.2300000,1.0000000,,,,0,
TLSDPFSNGK,ph,S,81,true,"SIRK1 phosphorylation",86a,23820729,"MaxQuant Score",77.7210000,0.9250000,,,,0.37099999189377,9.1850000
TLSDPFSNGK,ph,S,81,true,"atm and atr DNA damage response",88,25561503,"MASCOT Score",42.0000000,1.0000000,,,,,-2.6300000
TLSDPFSNGK,ph,S,81,true,"Tissue atlas Arabidopsis - ProteomicsDB",114,32188942,"MaxQuant score",96.7460000,1.0000000,,,,0.00042502098949626,
ALSPDVQEK,ph,S,303,false,"atm and atr DNA damage response",88,25561503,"MASCOT Score",39.0000000,1.0000000,,,,,-0.6100000
ALSPDVQEK,ph,S,303,false,"Tissue atlas Arabidopsis - ProteomicsDB",114,32188942,"MaxQuant score",132.8500000,1.0000000,,,,0.00011040500248782,
ALSPDVQEKLVR,ub,K,309,false,"upl3 mutant / wildtype",168,35926874,"MaxQuant score",96.6040000,1.0000000,0.3288365,,,7.1561298682354E-5,0.7437500
ENSPEGVFK,ph,S,315,true,"Tissue atlas Arabidopsis - ProteomicsDB",114,32188942,"MaxQuant score",87.9420000,1.0000000,,,,0.0027062499430031,
