Peptide,PTM,ModifiedAA,ModifiedPosition,PeptideUniqueToGene,ExperimentDesc,ExpID,PubmedID,ScoreType,IdentScore,LocProb,Log2FChange,PQ-val,QuantSig,PEP,MassErrorPPM
AEEEVIAIPVQPSDHKR,nt,A,2,true,"Arg/N-end rule seed, prt6 vs. Wt",99,29168982,"MASCOT Score",36.5600000,,,,,0.00047450000420213,-6.2322390
AEEEVIAIPVQPSDHKRKLEN,nta,A,2,true,"HUNTER N-terminome: legumain, GluC and trypsin",119,31951383,"MaxQuant score",80.7520000,,,,,,
AEEEVIAIPVQPSDHKR,nta,A,2,true,"Arg/N-end rule pathway Roots",80,25728785,"MASCOT Score",49.8200000,,,,,0.00088539998978376,
AEEEVIAIPVQPSDHKR,nta,A,2,true,"Arg/N-end rule seed, prt6 vs. Wt",99,29168982,"MASCOT Score",36.5600000,,-0.0984734,0.1653895,NO,0.00047450000420213,-6.2322390
AEEEVIAIPVQPSDHKR,nta,A,2,true,"HUNTER N-terminome: legumain, GluC and trypsin",119,31951383,"MaxQuant score",54.8050000,,,,,,
AEEEVIAIPVQPSDHK,nta,A,2,true,"Characterization plant N-terminal acetylation",6,22223895,"MASCOT Score",52.7100000,,,,,,
AEEEVIAIPVQPSDHK,ph,S,14,true,"Tissue atlas Arabidopsis - ProteomicsDB",114,32188942,"MaxQuant score",111.3400000,1.0000000,,,,6.4017797285487E-8,
KLENLESEILEQQHAGSIDNDVSVDDDKNASDYCQPK,ph,S,35,true,"Tissue atlas Arabidopsis - ProteomicsDB",114,32188942,"MaxQuant score",63.4290000,0.8945280,,,,1.9628300373942E-10,
KLENLESEILEQQHAGSIDNDVSVDDDKNASDYCQPK,ph,S,41,true,"Tissue atlas Arabidopsis - ProteomicsDB",114,32188942,"MaxQuant score",106.5200000,0.9990390,,,,2.572599922077E-34,
VQETIDAEESDNK,ph,S,115,true,"TOR Kinase and ABA Receptor",100,29290610,XCorr,3.0343204,1.0000000,,,,0.011199999600649,
EVNISGSQNEGEDDSKETNDVVAQK,ph,S,152,true,"Tissue atlas Arabidopsis - ProteomicsDB",114,32188942,"MaxQuant score",295.9300000,0.9999990,,,,0,
EVNISGSQNEGEDDSK,ph,S,152,true,"atm and atr DNA damage response",88,25561503,"MASCOT Score",50.0000000,0.9630000,,,,,0.7900000
EVNISGSQNEGEDDSKETNDVVAQK,ph,S,154,true,"LAXIC - mannitol vs control",84b,23660473,XCorr,5.5000000,0.9500000,,,,0.00026789598632604,
EVNISGSQNEGEDDSKETNDVVAQK,ph,S,154,true,"SnRK2 protein kinase substrates",85,23776212,XCorr,4.8106923,0.9030000,,,,3.1163001068535E-8,
EVNISGSQNEGEDDSKETNDVVAQK,ph,S,154,true,"Col-0 callus - FC Col-0 vs. Col-0 Xray",111a,31410901,,46.1300000,,2.4718149,0.0034791,YES,,1.3719976
EVNISGSQNEGEDDSKETNDVVAQK,ph,S,154,true,"Col-0 X-ray callus - FC Col-0 vs. Col-0 Xray",111b,31410901,,46.1300000,,2.4718149,0.0034791,YES,,1.3719976
EVNISGSQNEGEDDSKETNDVVAQK,ph,S,154,true,"atm callus - FC atm vs. atm Xray",111c,31410901,,46.1300000,,0.2341457,0.5036397,NO,,1.3719976
EVNISGSQNEGEDDSKETNDVVAQK,ph,S,154,true,"atm-3 X-ray callus - FC atm vs. atm Xray",111d,31410901,,46.1300000,,0.2341457,0.5036397,NO,,1.3719976
EVNISGSQNEGEDDSK,ph,S,154,true,"srk2dei ABA signaling phopshoproteomics",83,23572148,"MASCOT Score",54.0000000,,,,,,-0.0004000
EVNISGSQNEGEDDSK,ph,S,154,true,"atm and atr DNA damage response",88,25561503,"MASCOT Score",48.0000000,0.9610000,,,,,-1.6800000
EVNISGSQNEGEDDSK,ph,S,154,true,"TOR Kinase and ABA Receptor",100,29290610,XCorr,5.3573904,1.0000000,,,,3.3009999356182E-7,
EVNISGSQNEGEDDSK,ph,S,154,true,"Lateral root-induction - NAA vs control",106,23328941,"MASCOT Score",32.0000000,,,,,,
EVNISGSQNEGEDDSK,ph,S,154,true,"Tissue atlas Arabidopsis - ProteomicsDB",114,32188942,"MaxQuant score",281.0200000,0.9999990,,,,0,
EVNISGSQNEGEDDSKETNDVVAQK,ph,S,162,true,"Tissue atlas Arabidopsis - ProteomicsDB",114,32188942,"MaxQuant score",261.7900000,0.9984800,,,,0,
EVENGSKEVTDCDSQKEDEANAGGESK,ph,S,178,true,"Tissue atlas Arabidopsis - ProteomicsDB",114,32188942,"MaxQuant score",60.3790000,0.9908680,,,,1.1340599712639E-6,
EVTDCDSQKEDEANAGGESK,ph,T,182,true,"Tissue atlas Arabidopsis - ProteomicsDB",114,32188942,"MaxQuant score",99.4540000,1.0000000,,,,1.324699994143E-8,
EVTDCDSQKEDEANAGGESK,ph,S,186,true,"SnRK2 protein kinase substrates",85,23776212,XCorr,3.6653726,1.0000000,,,,0.0013173900078982,
EVTDCDSQKEDEANAGGESK,ph,S,186,true,"TOR Kinase and ABA Receptor",100,29290610,XCorr,5.0351596,0.8705000,,,,0.00013169999874663,
EVTDCDSQKEDEANAGGESK,ph,S,186,true,"Col-0 callus - FC Col-0 vs. Col-0 Xray",111a,31410901,,42.5400000,,2.9724581,0.0000000,NO,,0.1640866
EVTDCDSQKEDEANAGGESK,ph,S,186,true,"Col-0 X-ray callus - FC Col-0 vs. Col-0 Xray",111b,31410901,,42.5400000,,2.9724581,0.0000000,NO,,0.1640866
EVTDCDSQKEDEANAGGESK,ph,S,186,true,"atm callus - FC atm vs. atm Xray",111c,31410901,,42.5400000,,,0.0000000,NO,,0.1640866
EVTDCDSQKEDEANAGGESK,ph,S,186,true,"Tissue atlas Arabidopsis - ProteomicsDB",114,32188942,"MaxQuant score",421.2000000,1.0000000,,,,0,
EVNGSVSHDEIGDESK,ph,S,204,true,"atm and atr DNA damage response",88,25561503,"MASCOT Score",56.0000000,1.0000000,,,,,-0.7200000
EVNGSVSHDEIGDESK,ph,S,204,true,"TOR Kinase and ABA Receptor",100,29290610,XCorr,3.5525155,0.8768000,,,,0.0010319999419153,
EVNGSVSHDEIGDESK,ph,S,204,true,"Lateral root-induction - NAA vs control",106,23328941,"MASCOT Score",22.0000000,,,,,,
EVNGSVSHDEIGDESK,ph,S,204,true,"Tissue atlas Arabidopsis - ProteomicsDB",114,32188942,"MaxQuant score",243.6100000,0.9999560,,,,0,
EVNGSVSHDEIGDESK,ph,S,206,true,"atm and atr DNA damage response",88,25561503,"MASCOT Score",32.0000000,1.0000000,,,,,0.4400000
EVNGSVSHDEIGDESK,ph,S,206,true,"Tissue atlas Arabidopsis - ProteomicsDB",114,32188942,"MaxQuant score",299.4600000,0.9995600,,,,0,
EVNGGSTHKEVDDTQSTTR,ph,S,221,true,"Tissue atlas Arabidopsis - ProteomicsDB",114,32188942,"MaxQuant score",81.1440000,0.7908420,,,,1.9811699530692E-5,
IDVPSSKVGTLIGKGGEMVR,ub,K,249,true,"Arabidopsis ubiquitination COFRADIC",40,26744219,"MaxQuant Score",56.7080000,1.0000000,,,,1.4529999816659E-6,0.4480000
DAEADPSSALRPVEIIGTVSCIEK,so,C,290,true,"S-sulfenylation site detection using YAP1C",110,32714340,,,,,,,,
GGETIKNMQTKSR,ub,K,343,true,"Arabidopsis ubiquitination COFRADIC",40,26744219,"MaxQuant Score",87.0830000,1.0000000,,,,5.4410000302596E-5,0.2680000
GGETIKNMQTKSR,ub,K,348,true,"Arabidopsis ubiquitination COFRADIC",40,26744219,"MaxQuant Score",87.0830000,1.0000000,,,,5.4410000302596E-5,0.2680000
IQLIPQNEGDASKER,ph,S,364,true,"Tissue atlas Arabidopsis - ProteomicsDB",114,32188942,"MaxQuant score",53.0590000,1.0000000,,,,0.0013886099914089,
IQLIPQNEGDASKER,ub,K,365,true,"Arabidopsis ubiquitination COFRADIC",40,26744219,"MaxQuant Score",113.4000000,1.0000000,,,,5.6479998500462E-23,0.2170000
DVMYQDGRPSPYSGGFNQQAYQPR,ph,S,396,true,"Tissue atlas Arabidopsis - ProteomicsDB",114,32188942,"MaxQuant score",155.9500000,0.9987580,,,,0,
GQMYDQPHYDNPPMHQSY,nt,G,510,true,"Arabidopsis translation initiation landscape - NT",167b,35069635,,,,,,,,
