Peptide,PTM,ModifiedAA,ModifiedPosition,PeptideUniqueToGene,ExperimentDesc,ExpID,PubmedID,ScoreType,IdentScore,LocProb,Log2FChange,PQ-val,QuantSig,PEP,MassErrorPPM
MEQGGGGGGNEVVEEASPISSRPPANNLEELMR,nta,M,1,true,"HUNTER N-terminome: legumain, GluC and trypsin",119,31951383,"MaxQuant score",48.3920000,,,,,,
MEQGGGGGGNEVVEEASPISSRPPANNLEELMR,ph,S,17,true,"TOR Kinase and ABA Receptor",100,29290610,XCorr,6.3135996,0.9999000,,,,2.4409999355157E-7,
MEQGGGGGGNEVVEEASPISSRPPANNLEELMR,ph,S,17,true,"Tissue atlas Arabidopsis - ProteomicsDB",114,32188942,"MaxQuant score",72.1050000,0.8702200,,,,1.494369948965E-12,
FSAAADDGGLGGGGGGGGGGSASSSSGNRWPR,ph,S,35,true,"Tissue atlas Arabidopsis - ProteomicsDB",114,32188942,"MaxQuant score",43.4440000,0.9311460,,,,0.00036742899101228,
FSAAADDGGLGGGGGGGGGGSASSSSGNR,ph,S,54,true,"atm and atr DNA damage response",88,25561503,"MASCOT Score",106.0000000,0.9920000,,,,,0.0200000
SFLEALEKR,me1,K,294,true,"Arabidopsis protein methylome",123,31809900,"MaxQuant Score",123.7500000,1.0000000,,,,5.6872800739682E-12,-0.3079200
SFLEALEKR,me2,K,294,true,"Arabidopsis protein methylome",123,31809900,"MaxQuant Score",182.3900000,1.0000000,,,,0,0.1152100
EKWENINK,ac,K,487,false,"Quantitative Acetylproteomics",101,29440448,,,,,,,,
VLGSGGGSSTSGLPQDQK,ph,S,529,true,"Tissue atlas Arabidopsis - ProteomicsDB",114,32188942,"MaxQuant score",156.1300000,0.9999360,,,,2.395089952589E-21,
VLGSGGGSSTSGLPQDQK,ph,S,533,true,"Tissue atlas Arabidopsis - ProteomicsDB",114,32188942,"MaxQuant score",284.4600000,0.9969150,,,,0,
VLGSGGGSSTSGLPQDQK,ph,S,536,true,"Tissue atlas Arabidopsis - ProteomicsDB",114,32188942,"MaxQuant score",195.2500000,0.9051470,,,,2.8025969286496E-45,
SAAFEIAFQSPANR,ph,S,650,true,"STN8 phosphoproteome",38,21768351,"MASCOT Score",74.7900000,,,,,,-0.6380880
SAAFEIAFQSPANR,ph,S,650,true,"Chloroplast kinase substrates",60,19376835,"MASCOT Score",65.7100000,,,,,,-0.8142190
SAAFEIAFQSPANR,ph,S,650,true,"srk2dei ABA signaling phopshoproteomics",83,23572148,"MASCOT Score",80.0000000,,,,,,0.0012000
SAAFEIAFQSPANR,ph,S,650,true,"SnRK2 protein kinase substrates",85,23776212,XCorr,3.0695601,1.0000000,,,,0.0047394898720086,
SAAFEIAFQSPANR,ph,S,650,true,"atm and atr DNA damage response",88,25561503,"MASCOT Score",88.0000000,1.0000000,,,,,-0.6400000
SAAFEIAFQSPANR,ph,S,650,true,"TOR Kinase and ABA Receptor",100,29290610,XCorr,4.7457223,1.0000000,,,,1.9900001007045E-6,
SAAFEIAFQSPANR,ph,S,650,true,"Lateral root-induction - NAA vs control",106,23328941,"MASCOT Score",33.0000000,,,,,,
SAAFEIAFQSPANR,ph,S,650,true,"Tissue atlas Arabidopsis - ProteomicsDB",114,32188942,"MaxQuant score",306.6500000,1.0000000,,,,0,
