Peptide,PTM,ModifiedAA,ModifiedPosition,PeptideUniqueToGene,ExperimentDesc,ExpID,PubmedID,ScoreType,IdentScore,LocProb,Log2FChange,PQ-val,QuantSig,PEP,MassErrorPPM
ATPAPPVGPALGSK,ph,S,99,true,"atm and atr DNA damage response",88,25561503,"MASCOT Score",55.0000000,1.0000000,,,,,-0.4900000
GVNIMAFCKDYNAR,me3,K,109,true,"Arabidopsis protein methylome",123,31809900,"MaxQuant Score",148.4100000,1.0000000,,,,0,-0.7978000
AGVEKGSKDPQQDKVGVITIDQLR,nt,A,152,true,"Metacaspase9 substrates - Col-0 / mc9",51a,23964026,"MASCOT Score",54.0000000,,1.1928506,,NO,,-2.5029414
GSKDPQQDKVGVITIDQLR,ac,K,165,true,"Quantitative Acetylproteomics",101,29440448,,,,,,,,
TIAAEKLPDLNCTTIESAMR,sno,C,187,true,"Site-specific nitrosomeproteomic id - gsnor1-3",90a,25699590,XCorr,2.3200000,,,,,0.055520001798868,-4.3700000
LPDLNCTTIESAMR,sno,C,187,true,"Site-specific nitrosomeproteomic id - gsnor1-3",90a,25699590,XCorr,3.3265941,,,,,1.4949999922464E-6,-6.5489734
LPDLNCTTIESAMR,sno,C,187,true,"Site-specific nitrosomeproteomic id - gsnor1-3",90b,25699590,XCorr,3.6200000,,,,,0.013860000297427,-7.5200000
LPDLNCTTIESAMR,sno,C,187,true,"hot5-4 / wildtype, FAT-switch S-nitrosoproteome",169,37277371,,,,0.3298149,0.0967454,NO,,
TIAAEKLPDLNCTTIESAMR,so,C,187,true,"S-sulfenylation site detection using YAP1C",110,32714340,,,,,,,,
