Peptide,PTM,ModifiedAA,ModifiedPosition,PeptideUniqueToGene,ExperimentDesc,ExpID,PubmedID,ScoreType,IdentScore,LocProb,Log2FChange,PQ-val,QuantSig,PEP,MassErrorPPM
AVVETGAAAT,nt,A,2,true,"Arg/N-end rule seed, prt6 vs. Wt",99,29168982,"MASCOT Score",61.8400000,,0.4919082,0.2498016,NO,0.019710000604391,-0.3161300
IGSHVARSDGVDGGESFK,ph,S,70,true,"atm and atr DNA damage response",88,25561503,"MASCOT Score",28.0000000,1.0000000,,,,,0.2400000
IGSHVARSDGVDGGESFK,ph,S,70,true,"TOR Kinase and ABA Receptor",100,29290610,XCorr,3.7340782,1.0000000,,,,0.002773999935016,
SDGVDGGESFKR,ph,S,70,true,"Tissue atlas Arabidopsis - ProteomicsDB",114,32188942,"MaxQuant score",133.1500000,1.0000000,,,,8.6508296525041E-15,
SDGVDGGESFK,ph,S,70,true,"atm and atr DNA damage response",88,25561503,"MASCOT Score",48.0000000,1.0000000,,,,,-0.0900000
SDGVDGGESFKR,ph,S,78,true,"atm and atr DNA damage response",88,25561503,"MASCOT Score",43.0000000,1.0000000,,,,,-0.1100000
SDGVDGGESFKR,ph,S,78,true,"TOR Kinase and ABA Receptor",100,29290610,XCorr,2.9224830,1.0000000,,,,0.0062350002117455,
SDGVDGGESFKR,ph,S,78,true,"Tissue atlas Arabidopsis - ProteomicsDB",114,32188942,"MaxQuant score",180.8500000,1.0000000,,,,8.1895701554757E-20,
SDGVDGGESFKR,ac,K,80,true,"Quantitative Acetylproteomics",101,29440448,,,,,,,,
VLPSKTAIAPVNPTFLPR,ub,K,247,false,"upl3 mutant / wildtype",168,35926874,"MaxQuant score",84.6530000,1.0000000,0.3895668,,,2.3454599613615E-6,1.0537000
TPVRPRSPR,ph,S,352,true,"Tissue atlas Arabidopsis - ProteomicsDB",114,32188942,"MaxQuant score",58.5110000,0.9999370,,,,0.0093265604227781,
