Peptide,PTM,ModifiedAA,ModifiedPosition,PeptideUniqueToGene,ExperimentDesc,ExpID,PubmedID,ScoreType,IdentScore,LocProb,Log2FChange,PQ-val,QuantSig,PEP,MassErrorPPM
AQASFSDPFVLQLAE,nt,A,37,true,"N-terminal ChaFRADIC",92,26010716,"MASCOT Score",28.4500000,,,,,0.00025109999114648,
QASFSDPFVLQLAE,nt,Q,38,true,"N-terminal ChaFRADIC",92,26010716,"MASCOT Score",75.8000000,,,,,9.6109999958571E-8,
QASFSDPFVLQLAE,nt,Q,38,true,"HUNTER N-terminome: legumain, GluC and trypsin",119,31951383,"MaxQuant score",87.6180000,,,,,,
ASFSDPFVLQLAESLEDSLSASPSSSLPLQR,nt,A,39,true,"N-terminal ChaFRADIC",92,26010716,"MASCOT Score",45.9900000,,,,,6.9190001283914E-8,
ASFSDPFVLQLAE,nt,A,39,true,"N-terminal ChaFRADIC",92,26010716,"MASCOT Score",65.3300000,,,,,7.7129999453973E-7,
SFSDPFVLQLAE,nt,S,40,true,"N-terminal ChaFRADIC",92,26010716,"MASCOT Score",51.8000000,,,,,4.0499999158783E-5,
SFSDPFVLQLAE,nt,S,40,true,"HUNTER N-terminome: legumain, GluC and trypsin",119,31951383,"MaxQuant score",85.5330000,,,,,,
IRDSSAETLLSTPWPSR,ph,S,85,true,"Phosphorylation in N starvation",63,22060019,"MASCOT Score",24.0000000,,,,,,-4.6742900
QEAESEYELVEVSTGGKLGR,nt,Q,291,true,"HUNTER N-terminome: legumain, GluC and trypsin",119,31951383,"MaxQuant score",106.9600000,,,,,,
QLHKCIVAHSSGQAVFDGNVR,nt,Q,355,true,"HUNTER N-terminome: legumain, GluC and trypsin",119,31951383,"MaxQuant score",44.7290000,,,,,,
