Peptide,PTM,ModifiedAA,ModifiedPosition,PeptideUniqueToGene,ExperimentDesc,ExpID,PubmedID,ScoreType,IdentScore,LocProb,Log2FChange,PQ-val,QuantSig,PEP,MassErrorPPM
SELVQDKESSVAASIAFNEAAGETPSELSHSR,nt,S,65,true,"N-terminal ChaFRADIC",92,26010716,"MASCOT Score",50.1600000,,,,,1.1980000325096E-14,
SELVQDKESSVAASIAFNEAAGETPSELSHSR,nt,S,65,true,"Stromal N-terminome",96,26371235,"MASCOT Score",60.4600000,,,,,,
SELVQDKESSVAASIAFNEAAGETPSELSHSR,nt,S,65,true,"HUNTER N-terminome: legumain, GluC and trypsin",119,31951383,"MaxQuant score",209.7500000,,,,,,
SELVQDKESSVAASIAFN,nt,S,65,true,"HUNTER N-terminome: legumain, GluC and trypsin",119,31951383,"MaxQuant score",129.3700000,,,,,,
SELVQDKE,nt,S,65,true,"N-terminal ChaFRADIC",92,26010716,"MASCOT Score",24.2200000,,,,,0.051819998770952,
SELVQDKESSVAASIAFNEAAGETPSELSHSR,nta,S,65,true,"FtsH12 N-terminome: WT / FtsH12 knockdown miRNA",118,33216923,"MaxQuant score",83.7760000,,,,,8.8099995991797E-6,
ELVQDKESSVAASIAFNEAAGETPSELSHSR,nt,E,66,true,"FtsH12 N-terminome: WT / FtsH12 knockdown miRNA",118,33216923,"MaxQuant score",77.6770000,,,,,0.003685399889946,
ELVQDKESSVAASIAFNEAAGETPSELSHSR,nt,E,66,true,"HUNTER N-terminome: legumain, GluC and trypsin",119,31951383,"MaxQuant score",136.6300000,,,,,,
ELVQDKESSVAASIAFN,nt,E,66,true,"HUNTER N-terminome: legumain, GluC and trypsin",119,31951383,"MaxQuant score",104.8700000,,,,,,
SSVAASIAFNE,nt,S,73,true,"N-terminal ChaFRADIC",92,26010716,"MASCOT Score",40.3000000,,,,,1.4790000022913E-5,
NLICVYSK,so,C,278,true,"Arabidopsis S-sulfenylation chemoproteomics",108,31578252,"pFind PSM Score",0.3121710,,1.0204100,,,,-1.1218109
SGGQLIWIAPSGGR,nt,S,312,true,"N-terminal ChaFRADIC",92,26010716,"MASCOT Score",33.0600000,,,,,0.00017369999841321,
SVNEQYEILNSAIKHR,ac,K,440,true,"Quantitative Acetylproteomics",101,29440448,,,,,,,,
