Peptide,PTM,ModifiedAA,ModifiedPosition,PeptideUniqueToGene,ExperimentDesc,ExpID,PubmedID,ScoreType,IdentScore,LocProb,Log2FChange,PQ-val,QuantSig,PEP,MassErrorPPM
TLITCAQE,nt,T,42,true,"N-terminal ChaFRADIC",92,26010716,"MASCOT Score",44.2400000,,,,,0.0067289997823536,
AQETIVIGLAADSGCGKSTFMRR,nt,A,47,true,"Stromal N-terminome",96,26371235,"MASCOT Score",34.6600000,,,,,,
AQETIVIGLAADSGCGKSTFMR,nt,A,47,true,"N-terminal ChaFRADIC",92,26010716,"MASCOT Score",46.1900000,,,,,2.6339999625868E-11,
AQETIVIGLAADSGCGKSTFMR,nt,A,47,true,"Stromal N-terminome",96,26371235,"MASCOT Score",97.8900000,,,,,,
AQETIVIGLAADSGCGKSTFMR,nt,A,47,true,"FtsH12 N-terminome: WT / FtsH12 knockdown miRNA",118,33216923,"MaxQuant score",134.2600000,,0.1395054,0.6296309,NO,0,
AQETIVIGLAADSGCGKSTFMR,nt,A,47,true,"HUNTER N-terminome: legumain, GluC and trypsin",119,31951383,"MaxQuant score",179.5000000,,,,,,
AQETIVIGLAADSGCGKSTFMR,nt,A,47,true,"Arabidopsis translation initiation landscape - NT",167b,35069635,,,,,,,,
AQETIVIGLAAD,nt,A,47,true,"HUNTER N-terminome: legumain, GluC and trypsin",119,31951383,"MaxQuant score",124.6700000,,,,,,
AQETIVIGL,nt,A,47,true,"N-terminal ChaFRADIC",92,26010716,"MASCOT Score",76.3000000,,,,,0.0010470000561327,
QETIVIGLAADSGCGKSTFMR,nt,Q,48,true,"N-terminal ChaFRADIC",92,26010716,"MASCOT Score",35.3000000,,,,,8.9899998556575E-9,
QETIVIGLAADSGCGKSTFMR,nt,Q,48,true,"Stromal N-terminome",96,26371235,"MASCOT Score",57.2900000,,,,,,
QETIVIGL,nt,Q,48,true,"N-terminal ChaFRADIC",92,26010716,"MASCOT Score",65.0100000,,,,,0.004228999838233,
LTSVFGGAAKPPK,ac,K,79,true,"Quantitative Acetylproteomics",101,29440448,,,,,,,,
TTTVICLDDYHSLDR,nt,T,95,true,"Stromal N-terminome",96,26371235,"MASCOT Score",43.9400000,,,,,,
GGNPDSNTLISDTTTVICLDDYHSLDR,sno,C,100,true,"Site-specific nitrosomeproteomic id - gsnor1-3",90a,25699590,XCorr,4.1800000,,,,,0.030279999598861,-4.5100000
GGNPDSNTLISDTTTVICLDDYHSLDR,sno,C,100,true,"Site-specific nitrosomeproteomic id - gsnor1-3",90b,25699590,XCorr,3.8301563,,,,,0.0073359999805689,-6.0279811
LDDYHSLDR,nt,L,101,true,"Arg/N-end rule seed, prt6 vs. Wt",99,29168982,"MASCOT Score",32.9200000,,-0.8404713,0.0091623,NO,0.12749999761581,-0.3954218
QKVTALDPRANDFDLMYE,nt,Q,115,true,"HUNTER N-terminome: legumain, GluC and trypsin",119,31951383,"MaxQuant score",71.8790000,,,,,,
QKVTALDPRAND,nt,Q,115,true,"HUNTER N-terminome: legumain, GluC and trypsin",119,31951383,"MaxQuant score",,,,,,,
EQKVTALDPR,ac,K,116,true,"Histone deacetylases- hda14 vs WT (low light)",98c,29061669,"MaxQuant Score",99.5000000,1.0000000,0.4660000,0.9885531,NO,0.0060000000521541,
EQKVTALDPR,ac,K,116,true,"Histone deacetylases substrates - hda14 vs WT",98e,29061669,"MaxQuant Score",110.1000000,1.0000000,-2.4670000,0.8892011,NO,1.1000000199601E-7,
VTALDPRANDFDLMYEQVK,mox,M,130,true,"cat2 Methionine oxidation - 1h stress",62a,25693801,"MASCOT Score",65.0000000,,0.1366052,,NO,,
VTALDPRANDFDLMYEQVK,mox,M,130,true,"cat2 Methionine oxidation - 3h stress",62b,25693801,"MASCOT Score",36.0000000,,0.0576783,,NO,,
ANDFDLMYEQVKALK,ac,K,135,true,"Histone deacetylases - apicidin vs control",98a,29061669,"MaxQuant Score",156.5000000,1.0000000,0.2180000,0.3499452,NO,1.0999999721918E-26,
ANDFDLMYEQVKALK,ac,K,135,true,"Histone deacetylases substrates - hda14 vs WT",98e,29061669,"MaxQuant Score",114.6000000,1.0000000,0.1970000,0.6982324,NO,1.5000000170218E-19,
SLESIKASIEAR,nt,S,212,true,"Stromal N-terminome",96,26371235,"MASCOT Score",32.3700000,,,,,,
GHSLESIK,ph,S,212,true,"atm and atr DNA damage response",88,25561503,"MASCOT Score",30.0000000,1.0000000,,,,,-2.6400000
GHSLESIK,ph,S,212,true,"Tissue atlas Arabidopsis - ProteomicsDB",114,32188942,"MaxQuant score",154.8400000,0.9999980,,,,0.0015342199476436,
GHSLESIK,ph,S,215,true,"atm and atr DNA damage response",88,25561503,"MASCOT Score",57.0000000,1.0000000,,,,,-0.4700000
GHSLESIK,ph,S,215,true,"Tissue atlas Arabidopsis - ProteomicsDB",114,32188942,"MaxQuant score",134.2300000,0.9998250,,,,0.0026968300808221,
GHSLESIKASIEAR,ac,K,217,true,"Histone deacetylases- hda14 vs WT (low light)",98c,29061669,"MaxQuant Score",112.0200000,1.0000000,1.0150000,0.3265878,NO,1.4000000192027E-5,
GHSLESIKASIEAR,cr,K,217,true,"Open search Plant PTM Viewer 2.0 - Crotonylation",164c,TBA,,,,,,,,
TLIPDDNEGKVLR,nt,T,248,true,"Stromal N-terminome",96,26371235,"MASCOT Score",39.5900000,,,,,,
DEGSTISWIPCGR,nta,D,279,true,"FtsH12 N-terminome: WT / FtsH12 knockdown miRNA",118,33216923,"MaxQuant score",94.8990000,,-0.4400230,0.0062976,NO,0,
KLTCSYPGIK,pgk,K,292,true,"Open search Plant PTM Viewer 2.0 - 3pgK",164f,TBA,,,,,,,,
LTCSYPGIK,sno,C,295,true,"Cold stress nitrosylation - 4°C vs 22°C",65,24388526,,,,,,,,
LTCSYPGIK,sno,C,295,true,"hot5-4 / wildtype, FAT-switch S-nitrosoproteome",169,37277371,,,,-0.5374924,0.0016155,NO,,
KLTCSYPGIK,ph,S,296,true,"Tissue atlas Arabidopsis - ProteomicsDB",114,32188942,"MaxQuant score",55.2580000,0.8811740,,,,0.017766300588846,
LTCSYPGIK,ph,S,296,true,"atm and atr DNA damage response",88,25561503,"MASCOT Score",37.0000000,0.9450000,,,,,-2.6300000
SHLSNLSTKFYGE,nt,S,334,true,"N-terminal ChaFRADIC",92,26010716,"MASCOT Score",37.8100000,,,,,8.2850000637791E-8,
FYGEVTQQMLK,mox,M,351,true,"cat2 Methionine oxidation - 1h stress",62a,25693801,"MASCOT Score",67.0000000,,0.1929281,,NO,,
FYGEVTQQMLK,mox,M,351,true,"cat2 Methionine oxidation - 3h stress",62b,25693801,"MASCOT Score",52.0000000,,-0.3445052,,NO,,
DLYEQLIANKATAR,nt,D,377,true,"Stromal N-terminome",96,26371235,"MASCOT Score",35.1800000,,,,,,
QLIANKATARAE,nt,Q,381,true,"HUNTER N-terminome: legumain, GluC and trypsin",119,31951383,"MaxQuant score",51.0920000,,,,,,
IRDLYEQLIANKATAR,ac,K,386,true,"Histone deacetylases- hda14 vs WT (low light)",98c,29061669,"MaxQuant Score",68.5300000,1.0000000,-0.1370000,0.9931160,NO,0.0040000001899898,
IRDLYEQLIANKATAR,ac,K,386,true,"Histone deacetylases substrates - hda14 vs WT",98e,29061669,"MaxQuant Score",78.5000000,1.0000000,-0.4830000,0.8016781,NO,1.200000042445E-6,
IRDLYEQLIANKATAR,ac,K,386,true,"Quantitative Acetylproteomics",101,29440448,,,,,,,,
IRDLYEQLIANK,ac,K,386,true,"Quantitative Acetylproteomics",101,29440448,,,,,,,,
