Peptide,PTM,ModifiedAA,ModifiedPosition,PeptideUniqueToGene,ExperimentDesc,ExpID,PubmedID,ScoreType,IdentScore,LocProb,Log2FChange,PQ-val,QuantSig,PEP,MassErrorPPM
MNRHHDPNPFDEDEEIVNPF,nta,M,1,true,"Arabidopsis translation initiation landscape - NTA",167a,35069635,,,,,,,,
MNRHHDPNPFDEDEE,nta,M,1,true,"HUNTER N-terminome: legumain, GluC and trypsin",119,31951383,"MaxQuant score",138.1900000,,,,,,
MNRHHDPNPF,nta,M,1,true,"N-term acetylation drought responses",5,26184543,,,,,,,,
HHDPNPFDEDEEIVNPFSK,ph,S,21,true,"Phosphorylation Early Elicitor Signaling",23,17317660,,,,,,,,
HHDPNPFDEDEEIVNPFSK,ph,S,21,true,"Tissue atlas Arabidopsis - ProteomicsDB",114,32188942,"MaxQuant score",134.4000000,1.0000000,,,,8.6443598030947E-16,
HHDPNPFDEDEEIVNPFSKGGGR,ub,K,22,true,"Ubiquitination Membrane Proteins",120,33585938,,,,,,,,
VPAASRPVEYGQSLDATVDIPLDNMNDSSQK,ph,S,39,true,"Phosphorylation Early Elicitor Signaling",23,17317660,,,,,,,,
KLADWEAELR,ub,K,60,true,"Ubiquitination Membrane Proteins",120,33585938,,,,,,,,
KLADWEAELR,ub,K,60,true,"upl3 mutant / wildtype",168,35926874,"MaxQuant score",53.4320000,1.0000000,-0.1408255,0.7282000,NO,0.005289239808917,-1.0010000
