Peptide,PTM,ModifiedAA,ModifiedPosition,PeptideUniqueToGene,ExperimentDesc,ExpID,PubmedID,ScoreType,IdentScore,LocProb,Log2FChange,PQ-val,QuantSig,PEP,MassErrorPPM
QELPVSGEPLAVESPMTNKK,ph,S,19,true,"TOR Kinase and ABA Receptor",100,29290610,XCorr,3.5641465,0.7713000,,,,0.00016330000653397,
QELPVSGEPLAVESPMTNKK,ph,S,19,true,"Tissue atlas Arabidopsis - ProteomicsDB",114,32188942,"MaxQuant score",390.3200000,0.9999670,,,,0,
QELPVSGEPLAVESPMTNK,ph,S,19,true,"atm and atr DNA damage response",88,25561503,"MASCOT Score",51.0000000,0.9980000,,,,,-0.3300000
QELPVSGEPLAVESPMTNK,ph,S,19,true,"TOR Kinase and ABA Receptor",100,29290610,XCorr,5.1723528,0.9280000,,,,2.6839998668038E-7,
QELPVSGEPLAVESPMTNKK,ph,T,22,true,"Tissue atlas Arabidopsis - ProteomicsDB",114,32188942,"MaxQuant score",123.1900000,0.9999420,,,,7.1761901840805E-17,
HTEENHEVEEVPQEVTNGVEEELSNK,ph,S,57,true,"Tissue atlas Arabidopsis - ProteomicsDB",114,32188942,"MaxQuant score",71.3380000,0.9510880,,,,2.0577299864044E-8,
VNPTCLVLSPTR,so,C,194,true,"Arabidopsis S-sulfenylation chemoproteomics",108,31578252,"pFind PSM Score",0.0479317,,,,,,0.0382862
EAGEPCGLK,ox,C,218,true,"OxiTRAQ Arabidopsis - 5 mM H2O2 versus control",47,24376095,,,,0.1286906,0.2974345,NO,,
SICVYGGSSK,so,C,224,true,"S-sulfenylation site detection using YAP1C",110,32714340,,,,,,,,
SLSLFKEGSCPLLVATDVAAR,nt,S,408,true,"Arabidopsis translation initiation landscape - NT",167b,35069635,,,,,,,,
ITFDNSDDED,ph,T,529,true,"Tyrosine phosphorylation in Arabidopsis",59,18463617,"MASCOT Score",33.0000000,,,,,,0.0000000
ATKITFDNSDDED,ph,S,533,true,"STN8 phosphoproteome",38,21768351,"MASCOT Score",59.2200000,,,,,,-0.7852440
ITFDNSDDED,ph,S,533,true,"STN8 phosphoproteome",38,21768351,"MASCOT Score",57.0800000,,,,,,-0.0914023
ITFDNSDDED,ph,S,533,true,"Tyrosine phosphorylation in Arabidopsis",59,18463617,"MASCOT Score",36.0000000,,,,,,-0.0800383
ITFDNSDDED,ph,S,533,true,"Chloroplast kinase substrates",60,19376835,"MASCOT Score",48.8000000,,,,,,-2.4727000
ITFDNSDDED,ph,S,533,true,"Conserved plant phosphoproteome - Arabidopsis",61a,20466843,"MASCOT Score",33.0000000,1.0000000,,,,,
ITFDNSDDED,ph,S,533,true,"srk2dei ABA signaling phopshoproteomics",83,23572148,"MASCOT Score",52.0000000,,,,,,0.0001000
ITFDNSDDED,ph,S,533,true,"LAXIC - ABA stress",84a,23660473,XCorr,2.4700000,1.0000000,,,,0.065256997942924,
ITFDNSDDED,ph,S,533,true,"LAXIC - mannitol vs control",84b,23660473,XCorr,3.0900000,1.0000000,,,,0.0030224600341171,
ITFDNSDDED,ph,S,533,true,"SnRK2 protein kinase substrates",85,23776212,XCorr,2.5092027,1.0000000,,,,1.5008499758551E-6,
ITFDNSDDED,ph,S,533,true,"atm and atr DNA damage response",88,25561503,"MASCOT Score",76.0000000,1.0000000,,,,,-0.4400000
ITFDNSDDED,ph,S,533,true,"TOR Kinase and ABA Receptor",100,29290610,XCorr,2.2973332,0.8770000,,,,0.014139999635518,
ITFDNSDDED,ph,S,533,true,"Phospho cell culture sucrose/TOR",109,30833711,,,0.9999270,,,,,
ITFDNSDDED,ph,S,533,true,"Col-0 callus - FC Col-0 vs. Col-0 Xray",111a,31410901,,36.4500000,,0.3141923,0.0000000,NO,,0.3983658
ITFDNSDDED,ph,S,533,true,"Col-0 X-ray callus - FC Col-0 vs. Col-0 Xray",111b,31410901,,36.4500000,,0.3141923,0.0000000,NO,,0.3983658
ITFDNSDDED,ph,S,533,true,"atm callus - FC atm vs. atm Xray",111c,31410901,,36.4500000,,-7.9064882,0.0000000,NO,,0.3983658
ITFDNSDDED,ph,S,533,true,"atm-3 X-ray callus - FC atm vs. atm Xray",111d,31410901,,36.4500000,,-7.9064882,0.0000000,NO,,0.3983658
ITFDNSDDED,ph,S,533,true,"Tissue atlas Arabidopsis - ProteomicsDB",114,32188942,"MaxQuant score",317.3200000,1.0000000,,,,0,
