Peptide,PTM,ModifiedAA,ModifiedPosition,PeptideUniqueToGene,ExperimentDesc,ExpID,PubmedID,ScoreType,IdentScore,LocProb,Log2FChange,PQ-val,QuantSig,PEP,MassErrorPPM
SVSFPECGSEFQDYTPCTDPKR,acy,C,79,true,"Arabidopsis S-acylation atlas - Meristem",163a,35681017,,,,,,,,
SVSFPECGSEFQDYTPCTDPKR,acy,C,89,true,"Arabidopsis S-acylation atlas - Meristem",163a,35681017,,,,,,,,
HCPPVYEK,sno,C,110,true,"hot5-4 / wildtype, FAT-switch S-nitrosoproteome",169,37277371,,,,-0.0477732,0.5192737,NO,,
NECLIPPPDGYKPPIR,sno,C,119,true,"hot5-4 / wildtype, FAT-switch S-nitrosoproteome",169,37277371,,,,0.7824987,0.0109311,YES,,
AFDMAHCSR,ox,C,268,false,"OxiTRAQ Arabidopsis - 5 mM H2O2 versus control",47,24376095,,,,-0.1137597,0.2835976,NO,,
AFDMAHCSR,sno,C,268,false,"hot5-4 / wildtype, FAT-switch S-nitrosoproteome",169,37277371,,,,,,,,
WRGWNTTMEDQK,ng,N,313,true,"Conserved N-glycosylation",74,22633491,"MaxQuant Score",106.5800000,1.0000000,,,,0.00013719999697059,0.3140000
SDYNKLQSLLTSMCFK,ox,C,334,true,"OxiTRAQ SA and flg22 responses - SA vs mock",91a,25720653,"MASCOT Score",23.1100000,,1.6780719,0.0170000,YES,,
SDYNKLQSLLTSMCFK,ox,C,334,true,"OxiTRAQ SA and flg22 responses - flg22 vs mock",91b,25720653,"MASCOT Score",23.1100000,,1.4541759,0.4650000,NO,,
REETEYAVKSEK,ac,K,584,true,"Quantitative Acetylproteomics",101,29440448,,,,,,,,
ILVCQK,sno,C,591,true,"hot5-4 / wildtype, FAT-switch S-nitrosoproteome",169,37277371,,,,,,,,
