Peptide,PTM,ModifiedAA,ModifiedPosition,PeptideUniqueToGene,ExperimentDesc,ExpID,PubmedID,ScoreType,IdentScore,LocProb,Log2FChange,PQ-val,QuantSig,PEP,MassErrorPPM
LKSLPAAPR,ph,S,57,true,"Chloroplast kinase substrates",60,19376835,"MASCOT Score",32.5200000,,,,,,-0.3341650
LKSLPAAPR,ph,S,57,true,"atm and atr DNA damage response",88,25561503,"MASCOT Score",30.0000000,1.0000000,,,,,-2.7000000
LKSLPAAPR,ph,S,57,true,"Phospho cell culture sucrose/TOR",109,30833711,,,1.0000000,,,,,
SLPAAPR,ph,S,57,true,"Tissue atlas Arabidopsis - ProteomicsDB",114,32188942,"MaxQuant score",148.1900000,1.0000000,,,,0.00016696899547242,
SVNVNFSGNR,ph,S,84,true,"Tyrosine phosphorylation in Arabidopsis",59,18463617,"MASCOT Score",52.0000000,,,,,,-0.6823047
SVNVNFSGNR,ph,S,84,true,"Chloroplast kinase substrates",60,19376835,"MASCOT Score",45.9700000,,,,,,0.0362854
SVNVNFSGNR,ph,S,84,true,"Conserved plant phosphoproteome - Arabidopsis",61a,20466843,"MASCOT Score",52.0000000,1.0000000,,,,,
SVNVNFSGNR,ph,S,84,true,"srk2dei ABA signaling phopshoproteomics",83,23572148,"MASCOT Score",37.0000000,,,,,,-0.0010000
SVNVNFSGNR,ph,S,84,true,"atm and atr DNA damage response",88,25561503,"MASCOT Score",38.0000000,1.0000000,,,,,0.1300000
SVNVNFSGNR,ph,S,84,true,"TOR Kinase and ABA Receptor",100,29290610,XCorr,3.5082221,1.0000000,,,,0.00024769999436103,
SVNVNFSGNR,ph,S,84,true,"Tissue atlas Arabidopsis - ProteomicsDB",114,32188942,"MaxQuant score",145.0100000,1.0000000,,,,6.7038098450212E-7,
TGSVSLSDEDSSNLSR,ph,S,104,true,"Tyrosine phosphorylation in Arabidopsis",59,18463617,"MASCOT Score",22.0000000,,,,,,0.2885644
TGSVSLSDEDSSNLSR,ph,S,104,true,"Tissue atlas Arabidopsis - ProteomicsDB",114,32188942,"MaxQuant score",188.4400000,0.9895210,,,,2.4596399913089E-27,
TGSVSLSDEDSSNLSRK,ph,S,106,true,"TOR Kinase and ABA Receptor",100,29290610,XCorr,2.4800916,0.8613000,,,,0.00018489999638405,
TGSVSLSDEDSSNLSR,ph,S,106,true,"Phosphorylation Early Elicitor Signaling",23,17317660,,,,,,,,
TGSVSLSDEDSSNLSR,ph,S,106,true,"Tyrosine phosphorylation in Arabidopsis",59,18463617,"MASCOT Score",98.0000000,,,,,,0.2885643
TGSVSLSDEDSSNLSR,ph,S,106,true,"Conserved plant phosphoproteome - Arabidopsis",61a,20466843,"MASCOT Score",22.0000000,1.0000000,,,,,
TGSVSLSDEDSSNLSR,ph,S,106,true,"atm and atr DNA damage response",88,25561503,"MASCOT Score",99.0000000,1.0000000,,,,,0.8200000
TGSVSLSDEDSSNLSR,ph,S,106,true,"TOR Kinase and ABA Receptor",100,29290610,XCorr,3.4682012,0.9740000,,,,2.8489999749581E-5,
TGSVSLSDEDSSNLSR,ph,S,106,true,"Phospho cell culture sucrose/TOR",109,30833711,,,0.9997050,,,,,
TGSVSLSDEDSSNLSR,ph,S,106,true,"Tissue atlas Arabidopsis - ProteomicsDB",114,32188942,"MaxQuant score",258.1200000,0.9999450,,,,0,
ILSPVKQQTK,ph,S,151,true,"Chloroplast kinase substrates",60,19376835,"MASCOT Score",49.7500000,,,,,,-0.6022750
ILSPVKQQTK,ph,S,151,true,"Tissue atlas Arabidopsis - ProteomicsDB",114,32188942,"MaxQuant score",138.0000000,1.0000000,,,,1.9811899619526E-5,
ILSPVK,ph,S,151,true,"Phosphorylation Early Elicitor Signaling",23,17317660,,,,,,,,
ILSPVK,ph,S,151,true,"TOR Kinase and ABA Receptor",100,29290610,XCorr,2.5465460,1.0000000,,,,0.011370000429451,
SSWFDKLSPSK,ph,S,206,true,"Tissue atlas Arabidopsis - ProteomicsDB",114,32188942,"MaxQuant score",200.9000000,0.9995910,,,,2.499710084332E-19,
SFGAATYSSGR,ph,S,234,true,"Chloroplast kinase substrates",60,19376835,"MASCOT Score",40.7500000,,,,,,0.8819170
SFGAATYSSGR,ph,S,234,true,"atm and atr DNA damage response",88,25561503,"MASCOT Score",48.0000000,1.0000000,,,,,0.0600000
SFGAATYSSGR,ph,S,234,true,"TOR Kinase and ABA Receptor",100,29290610,XCorr,3.5768285,1.0000000,,,,6.1179998738226E-6,
SFGAATYSSGR,ph,S,234,true,"Phospho cell culture sucrose/TOR",109,30833711,,,1.0000000,,,,,
SFGAATYSSGR,ph,S,234,true,"Tissue atlas Arabidopsis - ProteomicsDB",114,32188942,"MaxQuant score",176.1800000,1.0000000,,,,2.9654000609225E-12,
SFGAATYSSGR,ph,S,242,true,"atm and atr DNA damage response",88,25561503,"MASCOT Score",29.0000000,0.9380000,,,,,0.2100000
