Peptide,PTM,ModifiedAA,ModifiedPosition,PeptideUniqueToGene,ExperimentDesc,ExpID,PubmedID,ScoreType,IdentScore,LocProb,Log2FChange,PQ-val,QuantSig,PEP,MassErrorPPM
KTIKMETSSRQTKK,ac,K,574,true,"Histone deacetylases substrates - hda14 vs WT",98e,29061669,"MaxQuant Score",47.0000000,1.0000000,0.4190000,0.5345644,NO,0.0049999998882413,
KTIKMETSSRQTKK,ac,K,586,true,"Histone deacetylases substrates - hda14 vs WT",98e,29061669,"MaxQuant Score",47.0000000,0.8460000,0.4190000,0.5345644,NO,0.0049999998882413,
RSITFSGLELK,ph,T,593,true,"TOR Kinase and ABA Receptor",100,29290610,XCorr,2.9947319,0.9892000,,,,0.022099999710917,
SITFSGLELK,ph,T,593,true,"atm and atr DNA damage response",88,25561503,"MASCOT Score",58.0000000,0.9430000,,,,,-0.7500000
SITFSGLELK,ph,T,593,true,"TOR Kinase and ABA Receptor",100,29290610,XCorr,2.1697676,0.9991000,,,,0.017330000177026,
SITFSGLELK,ph,T,593,true,"Phospho cell culture sucrose/TOR",109,30833711,,,0.9982010,,,,,
SITFSGLELK,ph,T,593,true,"Tissue atlas Arabidopsis - ProteomicsDB",114,32188942,"MaxQuant score",160.8800000,0.9999470,,,,1.5873499705776E-6,
DVVLVESSGEEEA,ph,S,699,true,"atm and atr DNA damage response",88,25561503,"MASCOT Score",66.0000000,1.0000000,,,,,-0.2100000
DVVLVESSGEEEA,ph,S,700,true,"atm and atr DNA damage response",88,25561503,"MASCOT Score",66.0000000,1.0000000,,,,,-0.2100000
