Peptide,PTM,ModifiedAA,ModifiedPosition,PeptideUniqueToGene,ExperimentDesc,ExpID,PubmedID,ScoreType,IdentScore,LocProb,Log2FChange,PQ-val,QuantSig,PEP,MassErrorPPM
ELQSPRVLGSVTDLALDN,nt,E,54,true,"HUNTER N-terminome: legumain, GluC and trypsin",119,31951383,"MaxQuant score",66.5330000,,,,,,
ELQSPRVLGSVTD,nt,E,54,true,"HUNTER N-terminome: legumain, GluC and trypsin",119,31951383,"MaxQuant score",103.9100000,,,,,,
VLGSVTDLALDNSVE,nt,V,60,true,"N-terminal ChaFRADIC",92,26010716,"MASCOT Score",87.7700000,,,,,3.1909999620439E-7,
FGGTCVGNSER,ox,C,93,true,"OxiTRAQ Arabidopsis - 5 mM H2O2 versus control",47,24376095,,,,1.4566600,0.0019641,YES,,
FGGTCVGNSER,sno,C,93,true,"Site-specific nitrosomeproteomic id - gsnor1-3",90a,25699590,XCorr,2.1292551,,,,,0.15970000624657,-7.1269634
FGGTCVGNSER,sno,C,93,true,"hot5-4 / wildtype, FAT-switch S-nitrosoproteome",169,37277371,,,,,,,,
SFSDFVVGHGE,nt,S,197,true,"N-terminal ChaFRADIC",92,26010716,"MASCOT Score",20.7700000,,,,,4.2669998947531E-6,
NIFNLSAPGTMICR,sno,C,378,true,"Site-specific nitrosomeproteomic id - gsnor1-3",90a,25699590,XCorr,2.0661564,,,,,0.041749998927116,-5.0237240
LSQIEIIPNCSILAAVGQK,so,C,483,true,"S-sulfenylation site detection using YAP1C",110,32714340,,,,,,,,
ELMKEEGEK,ac,K,614,true,"Histone deacetylases - apicidin vs control",98a,29061669,"MaxQuant Score",70.4000000,1.0000000,0.0750000,0.7516229,NO,0.0089999996125698,
SFSEVVAEAKQAGFTEPDPRDDLSGTDVAR,nt,S,741,true,"Arabidopsis translation initiation landscape - NT",167b,35069635,,,,,,,,
PLQACASAEEFMEK,so,C,801,true,"Arabidopsis S-sulfenylation chemoproteomics",108,31578252,"pFind PSM Score",0.2176860,,1.1236000,,,,1.2343858
