Peptide,PTM,ModifiedAA,ModifiedPosition,PeptideUniqueToGene,ExperimentDesc,ExpID,PubmedID,ScoreType,IdentScore,LocProb,Log2FChange,PQ-val,QuantSig,PEP,MassErrorPPM
TKAVLSEVSDQTR,nt,T,58,true,"Arabidopsis translation initiation landscape - NT",167b,35069635,,,,,,,,
VLSEVSDQTRYPR,nt,V,61,true,"N-terminal ChaFRADIC",92,26010716,"MASCOT Score",40.1100000,,,,,0.00035009998828173,
VLSEVSDQTRYPR,nt,V,61,true,"Stromal N-terminome",96,26371235,"MASCOT Score",43.1800000,,,,,,
VLSEVSDQTR,nt,V,61,true,"N-terminal ChaFRADIC",92,26010716,"MASCOT Score",64.3400000,,,,,0.0016039999900386,
VLSEVSDQTR,nt,V,61,true,"Stromal N-terminome",96,26371235,"MASCOT Score",68.3800000,,,,,,
VLSEVSDQTR,nt,V,61,true,"Arg/N-end rule seed, prt6 vs. Wt",99,29168982,"MASCOT Score",76.2700000,,,,,0.0093679996207356,0.1662146
VLSEVSDQTR,nt,V,61,true,"Arabidopsis translation initiation landscape - NT",167b,35069635,,,,,,,,
VLSEVSDQTRYPR,nta,V,61,true,"N-terminal ChaFRADIC",92,26010716,"MASCOT Score",40.1100000,,,,,0.00035009998828173,
VLSEVSDQTRYPR,nta,V,61,true,"Stromal N-terminome",96,26371235,"MASCOT Score",43.1800000,,,,,,
VLSEVSDQTR,nta,V,61,true,"Characterization plant N-terminal acetylation",6,22223895,"MASCOT Score",69.8300000,,,,,,
VLSEVSDQTR,nta,V,61,true,"N-terminal ChaFRADIC",92,26010716,"MASCOT Score",64.3400000,,,,,0.0016039999900386,
VLSEVSDQTR,nta,V,61,true,"Stromal N-terminome",96,26371235,"MASCOT Score",68.3800000,,,,,,
VLSEVSDQTR,nta,V,61,true,"Arg/N-end rule seed, prt6 vs. Wt",99,29168982,"MASCOT Score",76.2700000,,,,,0.0093679996207356,0.1662146
VLSEVSDQTR,nta,V,61,true,"HUNTER N-terminome: legumain, GluC and trypsin",119,31951383,"MaxQuant score",44.2030000,,,,,,
VLSEVSDQTR,nta,V,61,true,"Arabidopsis translation initiation landscape - NTA",167a,35069635,,,,,,,,
TTGTISPAHLLEVVELAAK,ph,S,83,true,"Large-scale phosphorylation discovery",44,23111157,XCorr,3.1530000,,,,,,
GNPAAASVVEFVGGPMCWNTR,ox,C,206,true,"SPEAR - 50 mM H2O2 / mock",138b,34619326,,,,2.4868576,0.0053848,YES,,
IHVSKTDAVER,ac,K,231,true,"Quantitative Acetylproteomics",101,29440448,,,,,,,,
IAPATENLKSK,ac,K,352,true,"Quantitative Acetylproteomics",101,29440448,,,,,,,,
