Peptide,PTM,ModifiedAA,ModifiedPosition,PeptideUniqueToGene,ExperimentDesc,ExpID,PubmedID,ScoreType,IdentScore,LocProb,Log2FChange,PQ-val,QuantSig,PEP,MassErrorPPM
SFLVDCGSNATTEVDGR,ng,N,40,true,"Conserved N-glycosylation",74,22633491,"MaxQuant Score",170.9600000,1.0000000,,,,0,-0.0670000
TWVGDLSPNK,ng,N,57,true,"Conserved N-glycosylation",74,22633491,"MaxQuant Score",68.8910000,1.0000000,,,,0.016000000759959,1.0370000
NLILESTGHNATASSLVK,ng,N,158,true,"Conserved N-glycosylation",74,22633491,"MaxQuant Score",140.2100000,1.0000000,,,,3.379000096106E-24,-1.3080000
NLILESTGHNATASSLVK,ng,N,158,true,"N-linked Glycan Micro-heterogeneity Arabidopsis",134,29237727,,,,,,,,
NLILESTGHNATASSLVK,ng,N,158,true,"UDP-GlcNAc transporter glycopeptide analysis",135,30224661,,,,,,,1.7707503018526E-16,0.7000000
PLFLHVNNSTANAK,ph,S,483,true,"atm and atr DNA damage response",88,25561503,"MASCOT Score",44.0000000,0.9370000,,,,,0.4000000
PLFLHVNNSTANAK,ph,S,483,true,"Tissue atlas Arabidopsis - ProteomicsDB",114,32188942,"MaxQuant score",132.1400000,0.9373150,,,,7.5244497566018E-7,
LNTLAASTMGR,ph,T,498,true,"Large-scale phosphorylation discovery",44,23111157,XCorr,4.6790000,,,,,,
LNTLAASTMGR,ph,T,498,true,"atm and atr DNA damage response",88,25561503,"MASCOT Score",32.0000000,0.9990000,,,,,0.4200000
LNTLAASTMGR,ph,T,498,true,"TOR Kinase and ABA Receptor",100,29290610,XCorr,3.9113982,1.0000000,,,,2.2360000002664E-5,
LNTLAASTMGR,ph,T,498,true,"Tissue atlas Arabidopsis - ProteomicsDB",114,32188942,"MaxQuant score",136.2100000,1.0000000,,,,1.736700028232E-6,
LNTLAASTMGR,ph,T,503,true,"Tissue atlas Arabidopsis - ProteomicsDB",114,32188942,"MaxQuant score",110.8000000,0.8068200,,,,2.87100992864E-5,
AATKNFDDGLAIGVGGFGK,ub,K,518,true,"Ubiquitination Membrane Proteins",120,33585938,,,,,,,,
AGPSMDHTHVSTAVK,ph,S,678,true,"Tissue atlas Arabidopsis - ProteomicsDB",114,32188942,"MaxQuant score",84.4360000,0.8048860,,,,4.6561599447159E-5,
GSFGYLDPEYFR,ph,S,684,false,"Plasmamembrane phosphorylation",20,15308754,,,,,,,,
GSFGYLDPEYFR,ph,S,684,false,"Pollen phosphoproteome Arabidopsis",43,22631563,"MASCOT Score",45.2500000,,,,,,
GSFGYLDPEYFR,ph,S,684,false,"Tyrosine phosphorylation in Arabidopsis",59,18463617,"MASCOT Score",29.0000000,,,,,,-0.9806349
GSFGYLDPEYFR,ph,S,684,false,"TOR Kinase and ABA Receptor",100,29290610,XCorr,3.2853138,0.9999000,,,,0.0030320000369102,
GSFGYLDPEYFR,ph,S,684,false,"Tissue atlas Arabidopsis - ProteomicsDB",114,32188942,"MaxQuant score",101.3900000,0.9999880,,,,0.00012155299918959,
