Peptide,PTM,ModifiedAA,ModifiedPosition,PeptideUniqueToGene,ExperimentDesc,ExpID,PubmedID,ScoreType,IdentScore,LocProb,Log2FChange,PQ-val,QuantSig,PEP,MassErrorPPM
FGSSESPEVHANAAEILCTVAR,sno,C,218,true,"hot5-4 / wildtype, FAT-switch S-nitrosoproteome",169,37277371,,,,,,,,
LSSPSCTGR,sno,C,237,true,"hot5-4 / wildtype, FAT-switch S-nitrosoproteome",169,37277371,,,,0.2886939,0.0021690,NO,,
SRDSDDDDYHDR,ph,S,506,true,"LAXIC - mannitol vs control",84b,23660473,XCorr,3.6800000,0.9200000,,,,0.00033170101232827,
SRDSDDDDYHDR,ph,S,506,true,"atm and atr DNA damage response",88,25561503,"MASCOT Score",34.0000000,0.9980000,,,,,0.4400000
SRDSDDDDYHDR,ph,S,506,true,"Tissue atlas Arabidopsis - ProteomicsDB",114,32188942,"MaxQuant score",87.2870000,0.9997490,,,,0.00013928400585428,
SRDSDDDDYHDRDYDVAALANNLSQAFR,ph,S,509,true,"Arabidopsis root NAA phosphoproteome",18a,27643528,"MaxQuant Score",112.7400000,0.9250000,,,,1.475999991934E-18,-1.1990000
SRDSDDDDYHDRDYDVAALANNLSQAFR,ph,S,509,true,"Phospho cell culture sucrose/TOR",109,30833711,,,0.7683610,,,,,
SRDSDDDDYHDR,ph,S,509,true,"SnRK2 protein kinase substrates",85,23776212,XCorr,3.8001266,0.9780000,,,,0.015382899902761,
SRDSDDDDYHDR,ph,S,509,true,"atm and atr DNA damage response",88,25561503,"MASCOT Score",71.0000000,1.0000000,,,,,-0.4400000
SRDSDDDDYHDR,ph,S,509,true,"Tissue atlas Arabidopsis - ProteomicsDB",114,32188942,"MaxQuant score",147.7000000,0.9999860,,,,2.77814990568E-7,
SRDSDDDDYHDRDYDVAALANNLSQAFR,ph,Y,519,true,"srk2dei ABA signaling phopshoproteomics",83,23572148,"MASCOT Score",26.0000000,,,,,,-0.0010000
HPSENPSEPEPEKSPAWVEWR,ph,S,663,true,"Tissue atlas Arabidopsis - ProteomicsDB",114,32188942,"MaxQuant score",226.1800000,1.0000000,,,,0,
EDNDDDDDTDNKSAVK,ph,S,711,true,"Tissue atlas Arabidopsis - ProteomicsDB",114,32188942,"MaxQuant score",52.4980000,0.8385760,,,,0.0068088797852397,
TPGVPGDETTEK,ph,T,715,true,"Tissue atlas Arabidopsis - ProteomicsDB",114,32188942,"MaxQuant score",159.3500000,0.9999910,,,,0,
LPDESGVEPTENSPK,ph,T,736,true,"Tissue atlas Arabidopsis - ProteomicsDB",114,32188942,"MaxQuant score",159.3500000,0.8938100,,,,0,
TPGVPGDETTEKLPDESGVEPTENSPK,ph,S,739,true,"Arabidopsis root NAA phosphoproteome",18a,27643528,"MaxQuant Score",60.7620000,0.8840000,,,,1.0390000170446E-5,-1.0250000
TPGVPGDETTEKLPDESGVEPTENSPK,ph,S,739,true,"STN8 phosphoproteome",38,21768351,"MASCOT Score",54.7800000,,,,,,-1.1634000
TPGVPGDETTEKLPDESGVEPTENSPK,ph,S,739,true,"Chloroplast kinase substrates",60,19376835,"MASCOT Score",56.6600000,,,,,,-0.7485090
TPGVPGDETTEKLPDESGVEPTENSPK,ph,S,739,true,"srk2dei ABA signaling phopshoproteomics",83,23572148,"MASCOT Score",69.0000000,,,,,,-0.0014000
TPGVPGDETTEKLPDESGVEPTENSPK,ph,S,739,true,"LAXIC - ABA stress",84a,23660473,XCorr,4.7600000,0.9940000,,,,0.0013770000077784,
TPGVPGDETTEKLPDESGVEPTENSPK,ph,S,739,true,"LAXIC - mannitol vs control",84b,23660473,XCorr,4.7100000,0.9630000,,,,5.4500001733793E-11,
TPGVPGDETTEKLPDESGVEPTENSPK,ph,S,739,true,"SnRK2 protein kinase substrates",85,23776212,XCorr,5.3079109,0.9980000,,,,0.0016475899610668,
TPGVPGDETTEKLPDESGVEPTENSPK,ph,S,739,true,"Phospho cell culture sucrose/TOR",109,30833711,,,0.9831620,,,,,
TPGVPGDETTEKLPDESGVEPTENSPK,ph,S,739,true,"Col-0 callus - FC Col-0 vs. Col-0 Xray",111a,31410901,,37.7400000,,0.9967440,0.0306691,YES,,1.2523819
TPGVPGDETTEKLPDESGVEPTENSPK,ph,S,739,true,"Col-0 X-ray callus - FC Col-0 vs. Col-0 Xray",111b,31410901,,37.7400000,,0.9967440,0.0306691,YES,,1.2523819
TPGVPGDETTEKLPDESGVEPTENSPK,ph,S,739,true,"atm callus - FC atm vs. atm Xray",111c,31410901,,37.7400000,,0.4611380,0.2415099,NO,,1.2523819
TPGVPGDETTEKLPDESGVEPTENSPK,ph,S,739,true,"atm-3 X-ray callus - FC atm vs. atm Xray",111d,31410901,,37.7400000,,0.4611380,0.2415099,NO,,1.2523819
LPDESGVEPTENSPK,ph,S,739,true,"STN8 phosphoproteome",38,21768351,"MASCOT Score",84.8900000,,,,,,-0.7563020
LPDESGVEPTENSPK,ph,S,739,true,"Tyrosine phosphorylation in Arabidopsis",59,18463617,"MASCOT Score",29.0000000,,,,,,-1.0132850
LPDESGVEPTENSPK,ph,S,739,true,"srk2dei ABA signaling phopshoproteomics",83,23572148,"MASCOT Score",51.0000000,,,,,,-0.0006000
LPDESGVEPTENSPK,ph,S,739,true,"LAXIC - mannitol vs control",84b,23660473,XCorr,3.9000000,1.0000000,,,,0.00043403101153672,
LPDESGVEPTENSPK,ph,S,739,true,"atm and atr DNA damage response",88,25561503,"MASCOT Score",54.0000000,1.0000000,,,,,1.1200000
LPDESGVEPTENSPK,ph,S,739,true,"TOR Kinase and ABA Receptor",100,29290610,XCorr,5.0075054,1.0000000,,,,4.6570001188684E-9,
LPDESGVEPTENSPK,ph,S,739,true,"Lateral root-induction - NAA vs control",106,23328941,"MASCOT Score",30.0000000,,,,,,
LPDESGVEPTENSPK,ph,S,739,true,"Tissue atlas Arabidopsis - ProteomicsDB",114,32188942,"MaxQuant score",294.9400000,0.9999770,,,,0,
ASGIEPTESSPK,ph,T,748,true,"Lateral root-induction - NAA vs control",106,23328941,"MASCOT Score",28.0000000,,,,,,
ASGIEPTESSPK,ph,S,750,true,"Lateral root-induction - NAA vs control",106,23328941,"MASCOT Score",31.0000000,,,,,,
ASGIEPTESSPK,ph,S,751,true,"STN8 phosphoproteome",38,21768351,"MASCOT Score",44.8900000,,,,,,-0.6305740
ASGIEPTESSPK,ph,S,751,true,"Chloroplast kinase substrates",60,19376835,"MASCOT Score",33.9300000,,,,,,0.2264150
ASGIEPTESSPK,ph,S,751,true,"LAXIC - mannitol vs control",84b,23660473,XCorr,2.0400000,0.9750000,,,,0.017626900225878,
ASGIEPTESSPK,ph,S,751,true,"SnRK2 protein kinase substrates",85,23776212,XCorr,2.0818222,0.9700000,,,,0.018008600920439,
ASGIEPTESSPK,ph,S,751,true,"atm and atr DNA damage response",88,25561503,"MASCOT Score",43.0000000,0.9970000,,,,,-0.4000000
ASGIEPTESSPK,ph,S,751,true,"TOR Kinase and ABA Receptor",100,29290610,XCorr,2.9901249,0.9908000,,,,0.0032120000105351,
ASGIEPTESSPK,ph,S,751,true,"Phospho cell culture sucrose/TOR",109,30833711,,,0.8004520,,,,,
ASGAEVTGNLR,nt,A,754,true,"Metacaspase9 substrates - in vitro rMC9",51c,23964026,"MASCOT Score",83.0000000,,,,,,0.0874441
ASGIEPTESSPKASGAEVTGNLR,ph,S,755,true,"Tissue atlas Arabidopsis - ProteomicsDB",114,32188942,"MaxQuant score",91.7670000,0.9969970,,,,1.3372100093889E-9,
DSDPAESHADAK,ph,S,771,true,"Tissue atlas Arabidopsis - ProteomicsDB",114,32188942,"MaxQuant score",167.0900000,1.0000000,,,,1.429880045205E-14,
SSEPESPHGTK,ph,S,782,true,"atm and atr DNA damage response",88,25561503,"MASCOT Score",57.0000000,1.0000000,,,,,-1.1200000
SSEPESPHGTK,ph,S,782,true,"Tissue atlas Arabidopsis - ProteomicsDB",114,32188942,"MaxQuant score",194.0700000,0.9998130,,,,0,
