Peptide,PTM,ModifiedAA,ModifiedPosition,PeptideUniqueToGene,ExperimentDesc,ExpID,PubmedID,ScoreType,IdentScore,LocProb,Log2FChange,PQ-val,QuantSig,PEP,MassErrorPPM
LGSKSDAFQR,ph,S,8,true,"Tissue atlas Arabidopsis - ProteomicsDB",114,32188942,"MaxQuant score",64.4410000,0.9950590,,,,0.0060552000068128,
LGSKSDAFQR,ph,S,10,true,"atm and atr DNA damage response",88,25561503,"MASCOT Score",33.0000000,0.9920000,,,,,-1.0900000
LGSKSDAFQR,ph,S,10,true,"TOR Kinase and ABA Receptor",100,29290610,XCorr,2.5884166,0.9992000,,,,0.0017470000311732,
LGSKSDAFQR,ph,S,10,true,"Tissue atlas Arabidopsis - ProteomicsDB",114,32188942,"MaxQuant score",149.8200000,0.9997680,,,,1.5436199873875E-6,
ASTDPNLFGWPVVEHGGPMQSPGGSVLWNGISTGARPK,ph,S,192,true,"TOR Kinase and ABA Receptor",100,29290610,XCorr,4.5160432,0.8360000,,,,8.9779996415018E-6,
GGPESSGRFSTPLGSGNVLSEEEQK,ph,S,270,true,"TOR Kinase and ABA Receptor",100,29290610,XCorr,4.0219612,0.9882000,,,,4.786999852513E-6,
GGPESSGRFSTPLGSGNVLSEEEQK,ph,S,270,true,"Tissue atlas Arabidopsis - ProteomicsDB",114,32188942,"MaxQuant score",129.9400000,0.8102260,,,,7.2539200427435E-29,
GGPESSGRFSTPLGSGNVLSEEEQK,ph,T,275,true,"TOR Kinase and ABA Receptor",100,29290610,XCorr,4.2241421,0.9770000,,,,0.00026319999597035,
FSTPLGSGNVLSEEEQK,ph,T,275,true,"Tissue atlas Arabidopsis - ProteomicsDB",114,32188942,"MaxQuant score",257.2900000,0.9992850,,,,0,
GGPESSGRFSTPLGSGNVLSEEEQK,ph,S,279,true,"TOR Kinase and ABA Receptor",100,29290610,XCorr,4.2241421,0.9999000,,,,0.00026319999597035,
FSTPLGSGNVLSEEEQK,ph,S,279,true,"Phosphorylation nuclei-enriched fractions",28,19245862,,,,,,,,
FSTPLGSGNVLSEEEQK,ph,S,279,true,"Phytohormone-responsive phosphoproteins",34,20374526,"MASCOT Score",44.0000000,,,,,,0.0560302
FSTPLGSGNVLSEEEQK,ph,S,279,true,"Chloroplast kinase substrates",60,19376835,"MASCOT Score",50.2100000,,,,,,-0.0070328
FSTPLGSGNVLSEEEQK,ph,S,279,true,"srk2dei ABA signaling phopshoproteomics",83,23572148,"MASCOT Score",43.0000000,,,,,,0.0006000
FSTPLGSGNVLSEEEQK,ph,S,279,true,"LAXIC - ABA stress",84a,23660473,XCorr,4.5700000,1.0000000,,,,2.5700001060613E-7,
FSTPLGSGNVLSEEEQK,ph,S,279,true,"LAXIC - mannitol vs control",84b,23660473,XCorr,3.8400000,1.0000000,-1.5246820,,NO,0.00013756299449597,
FSTPLGSGNVLSEEEQK,ph,S,279,true,"SnRK2 protein kinase substrates",85,23776212,XCorr,2.3128681,1.0000000,,,,0.012022299692035,
FSTPLGSGNVLSEEEQK,ph,S,279,true,"atm and atr DNA damage response",88,25561503,"MASCOT Score",52.0000000,1.0000000,,,,,1.1200000
FSTPLGSGNVLSEEEQK,ph,S,279,true,"TOR Kinase and ABA Receptor",100,29290610,XCorr,3.9714060,0.9996000,,,,8.3550003182609E-6,
FSTPLGSGNVLSEEEQK,ph,S,279,true,"Lateral root-induction - NAA vs control",106,23328941,"MASCOT Score",34.0000000,,,,,,
FSTPLGSGNVLSEEEQK,ph,S,279,true,"Col-0 callus - FC Col-0 vs. Col-0 Xray",111a,31410901,,80.5200000,,1.9626588,0.0000000,NO,,0.9898128
FSTPLGSGNVLSEEEQK,ph,S,279,true,"Col-0 X-ray callus - FC Col-0 vs. Col-0 Xray",111b,31410901,,80.5200000,,1.9626588,0.0000000,NO,,0.9898128
FSTPLGSGNVLSEEEQK,ph,S,279,true,"atm callus - FC atm vs. atm Xray",111c,31410901,,80.5200000,,4.8502248,0.0000000,NO,,0.9898128
FSTPLGSGNVLSEEEQK,ph,S,279,true,"atm-3 X-ray callus - FC atm vs. atm Xray",111d,31410901,,80.5200000,,4.8502248,0.0000000,NO,,0.9898128
FSTPLGSGNVLSEEEQK,ph,S,279,true,"Tissue atlas Arabidopsis - ProteomicsDB",114,32188942,"MaxQuant score",302.9000000,1.0000000,,,,0,
FSTPLGSGNVLSEEEQK,ph,S,279,true,"Touch-induced phosphorylation: 40s touch vs untouc",136,30291188,"MASCOT score",111.6800000,,-0.0647617,0.5414963,NO,,3.5136550
ASPDCIANLEK,sno,C,327,true,"hot5-4 / wildtype, FAT-switch S-nitrosoproteome",169,37277371,,,,0.0989546,0.8817678,NO,,
LIDGYLAEVAPDVNLKLPK,ub,K,426,true,"Ubiquitination Membrane Proteins",120,33585938,,,,,,,,
LIDGYLAEVAPDVNLKLPK,ub,K,426,true,"upl3 mutant / wildtype",168,35926874,"MaxQuant score",87.2400000,1.0000000,1.1852323,0.3541800,NO,2.8908800686622E-7,-0.3696500
TSVAGCFLVSDNLDGGSR,ph,S,527,true,"Tissue atlas Arabidopsis - ProteomicsDB",114,32188942,"MaxQuant score",155.8800000,0.9999850,,,,7.7140597082529E-36,
SGGYVGGPNEGGGGGGGWATAVR,ph,S,532,true,"Phosphorylation Early Elicitor Signaling",23,17317660,,,,,,,,
SGGYVGGPNEGGGGGGGWATAVR,ph,S,532,true,"Tissue atlas Arabidopsis - ProteomicsDB",114,32188942,"MaxQuant score",317.1000000,1.0000000,,,,0,
QLRSGGYVGGPNEGGGGGGGWATAVR,ph,Y,535,true,"TOR Kinase and ABA Receptor",100,29290610,XCorr,3.7989419,0.8758000,,,,4.9059999582823E-6,
SGGYVGGPNEGGGGGGGWATAVR,ph,T,551,true,"Tissue atlas Arabidopsis - ProteomicsDB",114,32188942,"MaxQuant score",98.8060000,1.0000000,,,,9.0011401110424E-12,
VCELEK,sno,C,571,false,"hot5-4 / wildtype, FAT-switch S-nitrosoproteome",169,37277371,,,,,,,,
LKSHQMCSAQEGSVSK,ph,S,621,true,"Tissue atlas Arabidopsis - ProteomicsDB",114,32188942,"MaxQuant score",99.8730000,0.9998800,,,,1.7368199678458E-6,
SHQMCSAQEGSVSK,acy,C,625,true,"Arabidopsis S-acylation atlas - Silique",163e,35681017,,,,,,,,
SHQMCSAQEGSVSK,ph,S,631,true,"atm and atr DNA damage response",88,25561503,"MASCOT Score",28.0000000,0.9920000,,,,,-0.4100000
SHQMCSAQEGSVSK,ph,S,631,true,"TOR Kinase and ABA Receptor",100,29290610,XCorr,4.2589583,0.9781000,,,,0.00050590001046658,
SHQMCSAQEGSVSK,ph,S,631,true,"Tissue atlas Arabidopsis - ProteomicsDB",114,32188942,"MaxQuant score",216.2600000,0.9988160,,,,0,
SHQMCSAQEGSVSK,ph,S,633,true,"Tissue atlas Arabidopsis - ProteomicsDB",114,32188942,"MaxQuant score",115.5800000,0.9793440,,,,1.7701400241432E-13,
SHQMCSAQEGSVSKSNNENVK,ph,S,635,true,"Tissue atlas Arabidopsis - ProteomicsDB",114,32188942,"MaxQuant score",276.2700000,0.9998720,,,,0,
KASSISSER,ph,S,659,true,"atm and atr DNA damage response",88,25561503,"MASCOT Score",33.0000000,0.8620000,,,,,-0.0900000
KASSISSER,ph,S,660,true,"atm and atr DNA damage response",88,25561503,"MASCOT Score",33.0000000,0.8620000,,,,,-0.0900000
ASSISSER,ph,S,660,true,"atm and atr DNA damage response",88,25561503,"MASCOT Score",29.0000000,0.9940000,,,,,-0.2100000
ASSISSER,ph,S,662,true,"atm and atr DNA damage response",88,25561503,"MASCOT Score",34.0000000,0.9920000,,,,,0.2200000
KASSISSER,ph,S,663,true,"atm and atr DNA damage response",88,25561503,"MASCOT Score",20.0000000,0.9930000,,,,,0.6400000
ASSISSER,ph,S,663,true,"atm and atr DNA damage response",88,25561503,"MASCOT Score",34.0000000,0.9920000,,,,,0.2200000
ASSISSER,ph,S,663,true,"Tissue atlas Arabidopsis - ProteomicsDB",114,32188942,"MaxQuant score",72.2000000,0.8450970,,,,0.012264800257981,
