Peptide,PTM,ModifiedAA,ModifiedPosition,PeptideUniqueToGene,ExperimentDesc,ExpID,PubmedID,ScoreType,IdentScore,LocProb,Log2FChange,PQ-val,QuantSig,PEP,MassErrorPPM
AEEVGLDLEELR,nt,A,2,true,"Stromal N-terminome",96,26371235,"MASCOT Score",71.2200000,,,,,,
AEEVGLDLEELR,nt,A,2,true,"Arg/N-end rule seed, prt6 vs. Wt",99,29168982,"MASCOT Score",78.2800000,,,,,0.0008811000152491,-2.7569504
AEEVGLDLEE,nt,A,2,true,"N-term acetylation drought responses",5,26184543,,,,,,,,
AEEVGLDLEELRQLQN,nta,A,2,true,"HUNTER N-terminome: legumain, GluC and trypsin",119,31951383,"MaxQuant score",153.3800000,,,,,,
AEEVGLDLEELRQL,nta,A,2,true,"Arabidopsis translation initiation landscape - NTA",167a,35069635,,,,,,,,
AEEVGLDLEELR,nta,A,2,true,"Characterization plant N-terminal acetylation",6,22223895,"MASCOT Score",97.1200000,,,,,,
AEEVGLDLEELR,nta,A,2,true,"Arg/N-end rule pathway Roots",80,25728785,"MASCOT Score",77.2500000,,,,,1.8340000451644E-6,
AEEVGLDLEELR,nta,A,2,true,"Stromal N-terminome",96,26371235,"MASCOT Score",71.2200000,,,,,,
AEEVGLDLEELR,nta,A,2,true,"Arg/N-end rule seed, prt6 vs. Wt",99,29168982,"MASCOT Score",78.2800000,,,,,0.0008811000152491,-2.7569504
AEEVGLDLEELR,nta,A,2,true,"HUNTER N-terminome: legumain, GluC and trypsin",119,31951383,"MaxQuant score",142.8300000,,,,,,
AEEVGLDLEE,nta,A,2,true,"N-term acetylation drought responses",5,26184543,,,,,,,,
QLQNIAKR,ub,K,20,true,"Arabidopsis ubiquitination COFRADIC",40,26744219,"MaxQuant Score",85.2120000,1.0000000,,,,0.014000000432134,1.1040000
LRDSAVSSNAKPK,ph,S,45,true,"Tissue atlas Arabidopsis - ProteomicsDB",114,32188942,"MaxQuant score",57.7880000,0.8893400,,,,0.0035981200635433,
SGKAADPLKGL,ub,K,214,true,"Arabidopsis ubiquitination COFRADIC",40,26744219,"MaxQuant Score",70.0890000,1.0000000,,,,0.0020000000949949,0.5890000
SGKAADPLKGL,ub,K,220,true,"Arabidopsis ubiquitination COFRADIC",40,26744219,"MaxQuant Score",70.0890000,1.0000000,,,,0.0020000000949949,0.5890000
