Peptide,PTM,ModifiedAA,ModifiedPosition,PeptideUniqueToGene,ExperimentDesc,ExpID,PubmedID,ScoreType,IdentScore,LocProb,Log2FChange,PQ-val,QuantSig,PEP,MassErrorPPM
SKSLPYSVK,ph,S,4,true,"Tissue atlas Arabidopsis - ProteomicsDB",114,32188942,"MaxQuant score",49.6320000,0.9277320,,,,0.013143699616194,
VFSQSLLTLSTKR,ph,S,29,true,"Tissue atlas Arabidopsis - ProteomicsDB",114,32188942,"MaxQuant score",92.4390000,0.9984620,,,,6.6854801843874E-5,
VFSQSLLTLSTK,ph,S,29,true,"TOR Kinase and ABA Receptor",100,29290610,XCorr,3.6746819,0.9845000,,,,5.3669999033445E-5,
VFSQSLLTLSTK,ph,S,31,true,"Tissue atlas Arabidopsis - ProteomicsDB",114,32188942,"MaxQuant score",143.5800000,0.9807480,,,,1.5270099993359E-6,
VFSQSLLTLSTKR,ph,S,36,true,"Tissue atlas Arabidopsis - ProteomicsDB",114,32188942,"MaxQuant score",143.2800000,0.8094080,,,,3.0858001309753E-7,
GSSTNGSTISNSDPK,ng,N,114,true,"Conserved N-glycosylation",74,22633491,"MaxQuant Score",109.2900000,1.0000000,,,,4.6989998736535E-7,0.2070000
LNSNFTYLHDMYIEAMK,ng,N,377,true,"Conserved N-glycosylation",74,22633491,"MaxQuant Score",110.8900000,1.0000000,,,,1.0539999983905E-9,-0.7930000
MDHLVCFLPGTLALGATK,ox,C,428,true,"OxiTRAQ SA and flg22 responses - SA vs mock",91a,25720653,"MASCOT Score",32.4400000,,0.6040713,0.0010000,YES,,
MDHLVCFLPGTLALGATK,ox,C,428,true,"OxiTRAQ SA and flg22 responses - flg22 vs mock",91b,25720653,"MASCOT Score",32.4400000,,0.3785116,0.0130000,NO,,
LLSFEDLE,nt,L,452,true,"N-terminal ChaFRADIC",92,26010716,"MASCOT Score",42.5300000,,,,,0.11670000106096,
DYTEDGLDGGNK,ng,N,503,true,"Conserved N-glycosylation",74,22633491,"MaxQuant Score",100.9500000,1.0000000,,,,1.2350000361039E-5,-0.6020000
