Peptide,PTM,ModifiedAA,ModifiedPosition,PeptideUniqueToGene,ExperimentDesc,ExpID,PubmedID,ScoreType,IdentScore,LocProb,Log2FChange,PQ-val,QuantSig,PEP,MassErrorPPM
IEYISAELKR,ub,K,92,true,"Arabidopsis ubiquitination COFRADIC",40,26744219,"MaxQuant Score",121.9000000,1.0000000,,,,3.2929998269537E-5,0.8900000
RLDAILQDMEEK,mox,M,101,true,"cat2 Methionine oxidation - 3h stress",62b,25693801,"MASCOT Score",50.0000000,,-0.0636627,,NO,,
LDAILQDMEEKQNNKR,ub,K,104,true,"Arabidopsis ubiquitination COFRADIC",40,26744219,"MaxQuant Score",171.8100000,1.0000000,,,,0,-0.0340000
LDAILQDMEEKQNNKR,ub,K,108,true,"Arabidopsis ubiquitination COFRADIC",40,26744219,"MaxQuant Score",171.8100000,1.0000000,,,,0,-0.0340000
RETIMK,mox,M,113,true,"cat2 Methionine oxidation - 1h stress",62a,25693801,"MASCOT Score",33.0000000,,0.0006639,,NO,,
ETIMKLQQR,me1,K,114,true,"Arabidopsis protein methylome",123,31809900,"MaxQuant Score",79.4890000,1.0000000,,,,0.016033900901675,-0.0748520
ETIMKLQQR,ub,K,114,true,"Arabidopsis ubiquitination COFRADIC",40,26744219,"MaxQuant Score",109.7100000,1.0000000,,,,0.00068300002021715,-0.1310000
LQTIQAGKAK,ac,K,126,true,"Quantitative Acetylproteomics",101,29440448,,,,,,,,
LQTIQAGKAKA,ub,K,126,true,"Arabidopsis ubiquitination COFRADIC",40,26744219,"MaxQuant Score",108.3500000,1.0000000,,,,1.1280000222769E-7,-0.5370000
LQTIQAGKAKA,ub,K,128,true,"Arabidopsis ubiquitination COFRADIC",40,26744219,"MaxQuant Score",108.3500000,1.0000000,,,,1.1280000222769E-7,-0.5370000
