Peptide,PTM,ModifiedAA,ModifiedPosition,PeptideUniqueToGene,ExperimentDesc,ExpID,PubmedID,ScoreType,IdentScore,LocProb,Log2FChange,PQ-val,QuantSig,PEP,MassErrorPPM
SNGTVELINSGQK,ng,N,72,true,"Conserved N-glycosylation",74,22633491,"MaxQuant Score",172.2300000,1.0000000,,,,2.8849999158613E-26,0.3150000
SNGTVELINSGQK,ng,N,72,true,"N-linked Glycan Micro-heterogeneity Arabidopsis",134,29237727,,,,,,,,
SNGTVELINSGQK,ng,N,72,true,"UDP-GlcNAc transporter glycopeptide analysis",135,30224661,,,,,,,3.6637664744491E-14,1.1000000
TCAQLESINVSVASVNADADDMLASR,ng,N,135,true,"Conserved N-glycosylation",74,22633491,"MaxQuant Score",228.0200000,1.0000000,,,,0,1.6690000
NTSLGVLLPTNLDEEISSLPGWTVESNR,ng,N,231,true,"Conserved N-glycosylation",74,22633491,"MaxQuant Score",179.2900000,1.0000000,,,,0,0.0700000
CKEPLAIMAFAGDQAQNFHYMAQANSSFEK,ng,N,336,true,"Conserved N-glycosylation",74,22633491,"MaxQuant Score",194.6700000,1.0000000,,,,0,-1.3740000
AGLNFTAK,ng,N,345,true,"Conserved N-glycosylation",74,22633491,"MaxQuant Score",127.5200000,1.0000000,,,,0.0060000000521541,0.1250000
AGLNFTAK,ng,N,345,true,"N-Glycopeptide Profiling in Arabidopsis Infloresce",132,27067053,"MOWSE score",16.3000000,,,,,0.039000000804663,
