Peptide,PTM,ModifiedAA,ModifiedPosition,PeptideUniqueToGene,ExperimentDesc,ExpID,PubmedID,ScoreType,IdentScore,LocProb,Log2FChange,PQ-val,QuantSig,PEP,MassErrorPPM
VLKPVSELADTTTKPFSPEIVGKR,nt,V,72,true,"Arg/N-end rule pathway Roots",80,25728785,"MASCOT Score",37.7200000,,,,,3.8639998820145E-5,
VLKPVSELADTTTKPFSPEIVGKR,nt,V,72,true,"Stromal N-terminome",96,26371235,"MASCOT Score",61.4800000,,,,,,
VLKPVSELAD,nt,V,72,true,"HUNTER N-terminome: legumain, GluC and trypsin",119,31951383,"MaxQuant score",84.2130000,,,,,,
VLKPVSELA,nt,V,72,true,"Arabidopsis translation initiation landscape - NT",167b,35069635,,,,,,,,
VLKPVSELADTTTKPFSPEIVGKR,nta,V,72,true,"Arg/N-end rule pathway Roots",80,25728785,"MASCOT Score",46.7900000,,,,,3.657000036128E-7,
VLKPVSELADTTTKPFSPEIVGKR,nta,V,72,true,"Stromal N-terminome",96,26371235,"MASCOT Score",61.4800000,,,,,,
VLKPVSELA,nta,V,72,true,"Arabidopsis translation initiation landscape - NTA",167a,35069635,,,,,,,,
ELADTTTKPFSPEIVGKR,nt,E,78,true,"Arg/N-end rule pathway Roots",80,25728785,"MASCOT Score",42.1900000,,,,,7.8730001405347E-5,
ELADTTTKPFSPEIVGKR,nt,E,78,true,"Stromal N-terminome",96,26371235,"MASCOT Score",50.3900000,,,,,,
ELADTTTKPFSPEIVGKR,nt,E,78,true,"HUNTER N-terminome: legumain, GluC and trypsin",119,31951383,"MaxQuant score",61.6840000,,,,,,
ELADTTTKPFSPEIVGKR,nt,E,78,true,"Arabidopsis translation initiation landscape - NT",167b,35069635,,,,,,,,
ELADTTTKPFSPE,nt,E,78,true,"N-terminal ChaFRADIC",92,26010716,"MASCOT Score",21.1000000,,,,,0.0006693999748677,
ELADTTTKPFSPE,nt,E,78,true,"Stromal N-terminome",96,26371235,"MASCOT Score",74.5800000,,,,,,
ELADTTTKPFSPE,nt,E,78,true,"HUNTER N-terminome: legumain, GluC and trypsin",119,31951383,"MaxQuant score",196.2400000,,,,,,
ELADTTTKPFSPEIVGKR,nta,E,78,true,"FtsH12 N-terminome: WT / FtsH12 knockdown miRNA",118,33216923,"MaxQuant score",161.2300000,,,,,0,
TPPSGIGTTLDECFDIAEK,ox,C,246,true,"SPEAR - 10 mM H2O2 / mock",138a,34619326,,,,1.8994778,0.0065391,YES,,
TPPSGIGTTLDECFDIAEK,so,C,246,true,"S-sulfenylation site detection using YAP1C",110,32714340,,,,,,,,
MAAKLSVGYTLDQIPNDITR,ph,T,423,true,"Phosphorylation in N starvation",63,22060019,"MASCOT Score",99.0000000,,,,,,3.4395100
SLECGFSGWGCAK,so,C,502,true,"Arabidopsis S-sulfenylation chemoproteomics",108,31578252,"pFind PSM Score",0.0409324,,1.0204100,,,,-1.4514654
QIAFATKTTEEEVR,ac,K,598,true,"Quantitative Acetylproteomics",101,29440448,,,,,,,,
RISLGVVPSYK,ph,S,610,true,"Tissue atlas Arabidopsis - ProteomicsDB",114,32188942,"MaxQuant score",74.7330000,0.9999810,,,,0.0015141100157052,
ISLGVVPSYKR,ac,K,618,true,"Quantitative Acetylproteomics",101,29440448,,,,,,,,
GGIAKSEADALAIAK,ac,K,799,true,"Quantitative Acetylproteomics",101,29440448,,,,,,,,
YAALVMSGK,mox,M,974,true,"cat2 Methionine oxidation - 1h stress",62a,25693801,"MASCOT Score",52.0000000,,0.5380796,,NO,,
YAALVMSGK,mox,M,974,true,"cat2 Methionine oxidation - 3h stress",62b,25693801,"MASCOT Score",81.0000000,,-0.0848011,,NO,,
EVIPKHVSVK,ac,K,991,true,"Quantitative Acetylproteomics",101,29440448,,,,,,,,
FQGCDVILGPEMR,sno,C,1008,true,"hot5-4 / wildtype, FAT-switch S-nitrosoproteome",169,37277371,,,,,,,,
SLKSSAIK,ac,K,1164,true,"Quantitative Acetylproteomics",101,29440448,,,,,,,,
