Peptide,PTM,ModifiedAA,ModifiedPosition,PeptideUniqueToGene,ExperimentDesc,ExpID,PubmedID,ScoreType,IdentScore,LocProb,Log2FChange,PQ-val,QuantSig,PEP,MassErrorPPM
MDATEQSLR,nt,M,40,true,"Stromal N-terminome",96,26371235,"MASCOT Score",56.3500000,,,,,,
MDATEQSLR,nt,M,40,true,"Arg/N-end rule seed, prt6 vs. Wt",99,29168982,"MASCOT Score",63.1000000,,,,,0.031220000237226,-0.4650439
MDATEQSLR,nt,M,40,true,"FtsH12 N-terminome: WT / FtsH12 knockdown miRNA",118,33216923,"MaxQuant score",222.8100000,,-0.0033835,0.9739689,NO,0,
MDATEQSLRQSLSEKSSSVEAQGNAVRAL,nta,M,40,true,"Arabidopsis translation initiation landscape - NTA",167a,35069635,,,,,,,,
MDATEQSLR,nta,M,40,true,"Characterization plant N-terminal acetylation",6,22223895,"MASCOT Score",77.8300000,,,,,,
MDATEQSLR,nta,M,40,true,"Arg/N-end rule pathway Roots",80,25728785,"MASCOT Score",61.0400000,,,,,6.1079997976776E-5,
MDATEQSLR,nta,M,40,true,"Stromal N-terminome",96,26371235,"MASCOT Score",56.3500000,,,,,,
MDATEQSLR,nta,M,40,true,"Arg/N-end rule seed, prt6 vs. Wt",99,29168982,"MASCOT Score",63.1000000,,,,,0.031220000237226,-0.4650439
MDATEQSLR,nta,M,40,true,"HUNTER N-terminome: legumain, GluC and trypsin",119,31951383,"MaxQuant score",77.7320000,,,,,,
QSLSEKSSSVEAQGNAVR,nt,Q,49,true,"HUNTER N-terminome: legumain, GluC and trypsin",119,31951383,"MaxQuant score",60.0930000,,,,,,
QSLSEKSSSVEAQGNAVR,ub,K,54,true,"Arabidopsis ubiquitination COFRADIC",40,26744219,"MaxQuant Score",47.9040000,1.0000000,,,,3.7500001326407E-7,-0.7740000
SSSVEAQGNAVR,ph,S,57,true,"Tissue atlas Arabidopsis - ProteomicsDB",114,32188942,"MaxQuant score",74.5240000,0.8837350,,,,0.002563209971413,
LKLEKSTVEK,ph,S,93,true,"Tissue atlas Arabidopsis - ProteomicsDB",114,32188942,"MaxQuant score",91.8450000,0.8362510,,,,0.00034648898872547,
KAVVNTLER,ub,K,118,true,"Arabidopsis ubiquitination COFRADIC",40,26744219,"MaxQuant Score",59.9080000,1.0000000,,,,0.023000000044703,0.3940000
ASGHVDKFTDLMVK,ub,K,193,true,"upl3 mutant / wildtype",168,35926874,"MaxQuant score",63.1850000,1.0000000,0.2726205,0.8019400,NO,0.0015678700292483,-0.0431520
FTDLMVKDEK,mox,M,198,true,"cat2 Methionine oxidation - 1h stress",62a,25693801,"MASCOT Score",46.0000000,,-0.8556088,,NO,,
TGTCYR,sno,C,207,true,"hot5-4 / wildtype, FAT-switch S-nitrosoproteome",169,37277371,,,,,,,,
DYCTEKLEK,ox,C,218,true,"SPEAR - 10 mM H2O2 / mock",138a,34619326,,,,2.9917209,0.0247273,YES,,
SHPKFSDVAK,ac,K,361,true,"Quantitative Acetylproteomics",101,29440448,,,,,,,,
LCLGEAVAK,ox,C,388,false,"SPEAR - 50 mM H2O2 / mock",138b,34619326,,,,2.0608075,0.0446935,YES,,
LCLGEAVAK,sno,C,388,false,"hot5-4 / wildtype, FAT-switch S-nitrosoproteome",169,37277371,,,,,,,,
AHSDKSGTPLVAEEK,ac,K,472,true,"Quantitative Acetylproteomics",101,29440448,,,,,,,,
SGTPLVAEEK,ph,T,475,true,"atm and atr DNA damage response",88,25561503,"MASCOT Score",59.0000000,1.0000000,,,,,-1.0900000
SGTPLVAEEK,ph,T,475,true,"Tissue atlas Arabidopsis - ProteomicsDB",114,32188942,"MaxQuant score",101.7100000,0.9978280,,,,0.0010574599727988,
SGTPLVAEEKFAEPK,ac,K,482,true,"Histone deacetylases - apicidin vs control",98a,29061669,"MaxQuant Score",111.8000000,1.0000000,0.0990000,0.6823387,NO,8.8999996705752E-8,
SGTPLVAEEKFAEPK,ac,K,482,true,"Histone deacetylases substrates - hda14 vs WT",98e,29061669,"MaxQuant Score",58.9000000,1.0000000,-0.0440000,0.9594006,NO,0.00028999999631196,
FAEPKEVEK,ac,K,487,true,"Quantitative Acetylproteomics",101,29440448,,,,,,,,
GEVEFYVCTLK,sno,C,542,true,"hot5-4 / wildtype, FAT-switch S-nitrosoproteome",169,37277371,,,,0.4258639,0.0076187,NO,,
GEVEFYVCTLKK,so,C,542,true,"S-sulfenylation site detection using YAP1C",110,32714340,,,,,,,,
NMVSISKEK,ub,K,559,true,"upl3 mutant / wildtype",168,35926874,"MaxQuant score",77.0490000,1.0000000,0.2424501,0.7796200,NO,0.013017199933529,2.6797000
CTVFPLVQNQQFEEVAK,sno,C,618,true,"hot5-4 / wildtype, FAT-switch S-nitrosoproteome",169,37277371,,,,,,,,
VFPLVQNQQFE,nt,V,620,true,"Arg/N-end rule seed, prt6 vs. Wt",99,29168982,"MASCOT Score",34.1300000,,-0.0765354,0.7405599,NO,0.014659999869764,1.1752770
IDITGTSIGKR,ph,S,655,true,"Tissue atlas Arabidopsis - ProteomicsDB",114,32188942,"MaxQuant score",116.1900000,0.8395400,,,,5.6254198170791E-6,
IDITGTSIGKR,ac,K,658,true,"Quantitative Acetylproteomics",101,29440448,,,,,,,,
DSKDQVR,nt,D,686,true,"Metacaspase9 substrates - in vitro rMC9",51c,23964026,"MASCOT Score",52.0000000,,4.6551739,,NO,,0.4054727
VTLKEAASVVSSVSEGK,ub,K,696,true,"upl3 mutant / wildtype",168,35926874,"MaxQuant score",78.7800000,1.0000000,-0.0409718,0.9581200,NO,2.4132699763868E-5,-0.1764500
