Peptide,PTM,ModifiedAA,ModifiedPosition,PeptideUniqueToGene,ExperimentDesc,ExpID,PubmedID,ScoreType,IdentScore,LocProb,Log2FChange,PQ-val,QuantSig,PEP,MassErrorPPM
KSEGIALLSVYSDEDDEEMEDAEEEEEEDEKQR,ph,S,16,true,"SnRK2 protein kinase substrates",85,23776212,XCorr,5.1785836,0.8060000,,,,2.6705299083218E-10,
KSEGIALLSVYSDEDDEEMEDAEEEEEEDEK,ph,S,16,true,"TOR Kinase and ABA Receptor",100,29290610,XCorr,5.7776599,0.8707000,,,,5.6009997706497E-7,
SEGIALLSVYSDEDDEEMEDAEEEEEEDEK,ph,S,16,true,"TOR Kinase and ABA Receptor",100,29290610,XCorr,6.2160597,0.9807000,,,,2.972999936901E-6,
NQEESEKIIEEDQVEEANYMDEEEKGR,ph,S,42,true,"Tissue atlas Arabidopsis - ProteomicsDB",114,32188942,"MaxQuant score",73.8050000,0.9999940,,,,3.8029498994341E-10,
LLDGVGASSSAHGTPR,ph,S,81,true,"srk2dei ABA signaling phopshoproteomics",83,23572148,"MASCOT Score",40.0000000,,,,,,-0.0002000
LLDGVGASSSAHGTPR,ph,S,81,true,"Lateral root-induction - NAA vs control",106,23328941,"MASCOT Score",36.0000000,,,,,,
LLDGVGASSSAHGTPR,ph,S,82,true,"srk2dei ABA signaling phopshoproteomics",83,23572148,"MASCOT Score",45.0000000,,,,,,-0.0011000
LLDGVGASSSAHGTPR,ph,S,82,true,"atm and atr DNA damage response",88,25561503,"MASCOT Score",51.0000000,0.9900000,,,,,-1.8300000
LLDGVGASSSAHGTPR,ph,S,82,true,"Lateral root-induction - NAA vs control",106,23328941,"MASCOT Score",33.0000000,,,,,,
LLDGVGASSSAHGTPR,ph,S,82,true,"Tissue atlas Arabidopsis - ProteomicsDB",114,32188942,"MaxQuant score",179.9000000,0.8188990,,,,2.1215099791325E-26,
LLDGVGASSSAHGTPR,ph,S,83,true,"Chloroplast kinase substrates",60,19376835,"MASCOT Score",37.0000000,,,,,,-0.6557340
LLDGVGASSSAHGTPR,ph,S,83,true,"srk2dei ABA signaling phopshoproteomics",83,23572148,"MASCOT Score",52.0000000,,,,,,0.0006000
LLDGVGASSSAHGTPR,ph,S,83,true,"SnRK2 protein kinase substrates",85,23776212,XCorr,3.8715782,0.9250000,,,,0.010263600386679,
LLDGVGASSSAHGTPR,ph,S,83,true,"atm and atr DNA damage response",88,25561503,"MASCOT Score",88.0000000,0.9390000,,,,,0.2800000
LLDGVGASSSAHGTPR,ph,S,83,true,"Phospho cell culture sucrose/TOR",109,30833711,,,0.8066480,,,,,
LLDGVGASSSAHGTPR,ph,S,83,true,"Col-0 callus - FC Col-0 vs. Col-0 Xray",111a,31410901,,63.4600000,,-0.2157995,0.0000000,NO,,0.3671489
LLDGVGASSSAHGTPR,ph,S,83,true,"Col-0 X-ray callus - FC Col-0 vs. Col-0 Xray",111b,31410901,,63.4600000,,-0.2157995,0.0000000,NO,,0.3671489
LLDGVGASSSAHGTPR,ph,S,83,true,"atm callus - FC atm vs. atm Xray",111c,31410901,,63.4600000,,0.2608947,0.0000000,NO,,0.3671489
LLDGVGASSSAHGTPR,ph,S,83,true,"atm-3 X-ray callus - FC atm vs. atm Xray",111d,31410901,,63.4600000,,0.2608947,0.0000000,NO,,0.3671489
LLDGVGASSSAHGTPR,ph,S,83,true,"Tissue atlas Arabidopsis - ProteomicsDB",114,32188942,"MaxQuant score",325.3800000,0.9655480,,,,0,
LLDGVGASSSAHGTPR,ph,T,87,true,"STN8 phosphoproteome",38,21768351,"MASCOT Score",47.9500000,,,,,,0.5290700
LLDGVGASSSAHGTPR,ph,T,87,true,"Large-scale phosphorylation discovery",44,23111157,XCorr,3.7080000,,,,,,
LLDGVGASSSAHGTPR,ph,T,87,true,"Chloroplast kinase substrates",60,19376835,"MASCOT Score",37.0000000,,,,,,-0.6557340
LLDGVGASSSAHGTPR,ph,T,87,true,"srk2dei ABA signaling phopshoproteomics",83,23572148,"MASCOT Score",52.0000000,,,,,,0.0006000
LLDGVGASSSAHGTPR,ph,T,87,true,"SnRK2 protein kinase substrates",85,23776212,XCorr,3.8715782,1.0000000,,,,0.010263600386679,
LLDGVGASSSAHGTPR,ph,T,87,true,"atm and atr DNA damage response",88,25561503,"MASCOT Score",91.0000000,1.0000000,,,,,0.1000000
LLDGVGASSSAHGTPR,ph,T,87,true,"TOR Kinase and ABA Receptor",100,29290610,XCorr,5.0096469,0.9999000,,,,1.8090000594384E-5,
LLDGVGASSSAHGTPR,ph,T,87,true,"Lateral root-induction - NAA vs control",106,23328941,"MASCOT Score",28.0000000,,,,,,
LLDGVGASSSAHGTPR,ph,T,87,true,"Phospho cell culture sucrose/TOR",109,30833711,,,0.9999500,,,,,
LLDGVGASSSAHGTPR,ph,T,87,true,"Col-0 callus - FC Col-0 vs. Col-0 Xray",111a,31410901,,62.0900000,,-0.7038668,0.0000000,NO,,0.9397865
LLDGVGASSSAHGTPR,ph,T,87,true,"Col-0 X-ray callus - FC Col-0 vs. Col-0 Xray",111b,31410901,,62.0900000,,-0.7038668,0.0000000,NO,,0.9397865
LLDGVGASSSAHGTPR,ph,T,87,true,"atm callus - FC atm vs. atm Xray",111c,31410901,,62.0900000,,0.4070867,0.0000000,NO,,0.9397865
LLDGVGASSSAHGTPR,ph,T,87,true,"atm-3 X-ray callus - FC atm vs. atm Xray",111d,31410901,,62.0900000,,0.4070867,0.0000000,NO,,0.9397865
LLDGVGASSSAHGTPR,ph,T,87,true,"Tissue atlas Arabidopsis - ProteomicsDB",114,32188942,"MaxQuant score",257.5700000,1.0000000,,,,0,
SLDNDESSRPDWSNR,ph,S,90,true,"STN8 phosphoproteome",38,21768351,"MASCOT Score",51.3200000,,,,,,-2.0015500
SLDNDESSRPDWSNR,ph,S,90,true,"Tyrosine phosphorylation in Arabidopsis",59,18463617,"MASCOT Score",40.0000000,,,,,,-0.9694458
SLDNDESSRPDWSNR,ph,S,90,true,"srk2dei ABA signaling phopshoproteomics",83,23572148,"MASCOT Score",31.0000000,,,,,,0.0008000
SLDNDESSRPDWSNR,ph,S,90,true,"atm and atr DNA damage response",88,25561503,"MASCOT Score",24.0000000,1.0000000,,,,,0.0000000
SLDNDESSRPDWSNR,ph,S,90,true,"Lateral root-induction - NAA vs control",106,23328941,"MASCOT Score",29.0000000,,,,,,
SLDNDESSRPDWSNR,ph,S,90,true,"Phospho cell culture sucrose/TOR",109,30833711,,,0.9999990,,,,,
SLDNDESSRPDWSNR,ph,S,90,true,"Col-0 callus - FC Col-0 vs. Col-0 Xray",111a,31410901,,43.5100000,,0.3767567,0.0000000,NO,,0.4721650
SLDNDESSRPDWSNR,ph,S,90,true,"Col-0 X-ray callus - FC Col-0 vs. Col-0 Xray",111b,31410901,,43.5100000,,0.3767567,0.0000000,NO,,0.4721650
SLDNDESSRPDWSNR,ph,S,90,true,"atm callus - FC atm vs. atm Xray",111c,31410901,,43.5100000,,-0.1591780,0.0000000,NO,,0.4721650
SLDNDESSRPDWSNR,ph,S,90,true,"atm-3 X-ray callus - FC atm vs. atm Xray",111d,31410901,,43.5100000,,-0.1591780,0.0000000,NO,,0.4721650
SLDNDESSRPDWSNR,ph,S,90,true,"Tissue atlas Arabidopsis - ProteomicsDB",114,32188942,"MaxQuant score",191.7800000,1.0000000,,,,7.766750151982E-34,
SLDNDESSRPDWSNR,ph,S,97,true,"Tissue atlas Arabidopsis - ProteomicsDB",114,32188942,"MaxQuant score",91.5890000,0.8008950,,,,2.1271500372677E-5,
