Peptide,PTM,ModifiedAA,ModifiedPosition,PeptideUniqueToGene,ExperimentDesc,ExpID,PubmedID,ScoreType,IdentScore,LocProb,Log2FChange,PQ-val,QuantSig,PEP,MassErrorPPM
SSAQDPFYIVKEE,nt,S,2,true,"N-terminal ChaFRADIC",92,26010716,"MASCOT Score",37.6800000,,,,,0.0027199999894947,
SSAQDPFYIVKE,nt,S,2,true,"Arg/N-end rule seed, prt6 vs. Wt",99,29168982,"MASCOT Score",58.9700000,,,,,1.3279999677707E-7,0.3497064
SSAQDPFYIVKEEIQD,nta,S,2,true,"HUNTER N-terminome: legumain, GluC and trypsin",119,31951383,"MaxQuant score",45.9150000,,,,,,
SSAQDPFYIVKEE,nta,S,2,true,"N-terminal ChaFRADIC",92,26010716,"MASCOT Score",37.6800000,,,,,0.0027199999894947,
SSAQDPFYIVKEE,nta,S,2,true,"Arabidopsis translation initiation landscape - NTA",167a,35069635,,,,,,,,
SSAQDPFYIVKE,nta,S,2,true,"Arg/N-end rule seed, prt6 vs. Wt",99,29168982,"MASCOT Score",58.9700000,,-0.3201337,0.0553589,NO,1.3279999677707E-7,0.3497064
SSAQDPFYIVK,nta,S,2,true,"Characterization plant N-terminal acetylation",6,22223895,"MASCOT Score",42.8900000,,,,,,
NVKSGVLAGK,ph,S,100,true,"Pollen phosphoproteome Arabidopsis",43,22631563,"MASCOT Score",42.6000000,,,,,,
VSSGAGHASEVRR,ph,S,109,true,"Tissue atlas Arabidopsis - ProteomicsDB",114,32188942,"MaxQuant score",56.1220000,0.9821870,,,,0.0052528399974108,
VSSGAGHASEVRR,ph,S,115,true,"Tissue atlas Arabidopsis - ProteomicsDB",114,32188942,"MaxQuant score",73.1680000,0.9997470,,,,0.00034023000625893,
QQDEELDELSKSVQR,ph,S,169,true,"Tissue atlas Arabidopsis - ProteomicsDB",114,32188942,"MaxQuant score",120.4000000,0.9732930,,,,8.5803100091653E-7,
