Peptide,PTM,ModifiedAA,ModifiedPosition,PeptideUniqueToGene,ExperimentDesc,ExpID,PubmedID,ScoreType,IdentScore,LocProb,Log2FChange,PQ-val,QuantSig,PEP,MassErrorPPM
MLNLSYNPFSPSR,ng,N,186,true,"Conserved N-glycosylation",74,22633491,"MaxQuant Score",182.6800000,1.0000000,,,,1.3899999705536E-31,0.2430000
MLNLSYNPFSPSR,ng,N,186,true,"ER-associatied N-glycan degradation chilling stres",133,27558752,,,,,,,,
NSFSGVIPE,nt,N,382,true,"Arg/N-end rule seed, prt6 vs. Wt",99,29168982,"MASCOT Score",27.8400000,,-0.2833360,0.2411850,NO,0.058639999479055,-3.8129488
LNQLNLSYNR,ng,N,569,true,"Conserved N-glycosylation",74,22633491,"MaxQuant Score",185.5600000,1.0000000,,,,8.3400002182099E-11,1.6140000
LNQLNLSYNR,ng,N,569,true,"N-Glycopeptide Profiling in Arabidopsis Infloresce",132,27067053,"MOWSE score",25.3000000,,,,,0.0024000001139939,
LNQLNLSYNR,ng,N,569,true,"N-linked Glycan Micro-heterogeneity Arabidopsis",134,29237727,,,,,,,,
LNQLNLSYNR,ng,N,569,true,"UDP-GlcNAc transporter glycopeptide analysis",135,30224661,,,,,,,2.7386013456976E-9,0.2000000
NSFIGNPGLCGDIK,sno,C,599,true,"hot5-4 / wildtype, FAT-switch S-nitrosoproteome",169,37277371,,,,,,,,
GLCGSENEAK,sno,C,606,true,"hot5-4 / wildtype, FAT-switch S-nitrosoproteome",169,37277371,,,,-0.3120075,0.0252277,NO,,
WTLMSFHK,ph,S,661,true,"atm and atr DNA damage response",88,25561503,"MASCOT Score",28.0000000,1.0000000,,,,,-1.1800000
WTLMSFHK,ph,S,661,true,"TOR Kinase and ABA Receptor",100,29290610,XCorr,3.0343630,1.0000000,,,,0.023919999599457,
WTLMSFHK,ph,S,661,true,"Tissue atlas Arabidopsis - ProteomicsDB",114,32188942,"MaxQuant score",127.3000000,1.0000000,,,,1.7688800653559E-5,
LWTGSVKETGDCDPEK,ub,K,712,true,"upl3 mutant / wildtype",168,35926874,"MaxQuant score",63.6820000,1.0000000,0.8147555,,,0.00033073799568228,-0.5668000
AVDLTGKAPK,ub,K,845,true,"Ubiquitination Membrane Proteins",120,33585938,,,,,,,,
LDSCFK,sno,C,926,false,"hot5-4 / wildtype, FAT-switch S-nitrosoproteome",169,37277371,,,,,,,,
MLQEIGGGDEDSLHK,ph,S,969,true,"atm and atr DNA damage response",88,25561503,"MASCOT Score",72.0000000,1.0000000,,,,,-1.3300000
MLQEIGGGDEDSLHK,ph,S,969,true,"TOR Kinase and ABA Receptor",100,29290610,XCorr,4.2330914,1.0000000,,,,1.5829999711059E-6,
MLQEIGGGDEDSLHK,ph,S,969,true,"Phosphorylation tonoplast membrane fraction",107,18686298,"MASCOT Score",68.0000000,,,,,,
MLQEIGGGDEDSLHK,ph,S,969,true,"Tissue atlas Arabidopsis - ProteomicsDB",114,32188942,"MaxQuant score",265.9300000,1.0000000,,,,0,
DGKLTPYYNEDTSDQGSIA,ph,T,982,true,"Tissue atlas Arabidopsis - ProteomicsDB",114,32188942,"MaxQuant score",163.4100000,1.0000000,,,,7.2625998349565E-22,
LTPYYNEDTSDQGSIA,ph,S,990,true,"atm and atr DNA damage response",88,25561503,"MASCOT Score",56.0000000,0.9530000,,,,,-0.6200000
LTPYYNEDTSDQGSIA,ph,S,994,true,"atm and atr DNA damage response",88,25561503,"MASCOT Score",50.0000000,1.0000000,,,,,-0.0800000
