Peptide,PTM,ModifiedAA,ModifiedPosition,PeptideUniqueToGene,ExperimentDesc,ExpID,PubmedID,ScoreType,IdentScore,LocProb,Log2FChange,PQ-val,QuantSig,PEP,MassErrorPPM
VLLEKLWDDVVAGPQPDR,nt,V,2,true,"Arg/N-end rule pathway Roots",80,25728785,"MASCOT Score",36.1700000,,,,,5.2169998525642E-6,
KITTQPINIR,ph,T,28,true,"Tissue atlas Arabidopsis - ProteomicsDB",114,32188942,"MaxQuant score",179.9400000,0.9242730,,,,3.0117000004992E-9,
ITTQPINIR,ph,T,28,true,"srk2dei ABA signaling phopshoproteomics",83,23572148,"MASCOT Score",34.0000000,,,,,,0.0011000
KITTQPINIR,ph,T,29,true,"STN8 phosphoproteome",38,21768351,"MASCOT Score",53.1100000,,,,,,0.0961640
KITTQPINIR,ph,T,29,true,"PAMP-triggered phosphorylation",48,24601666,"MASCOT Score",26.8400000,,,,,,
KITTQPINIR,ph,T,29,true,"SnRK2 protein kinase substrates",85,23776212,XCorr,2.7231376,0.9980000,,,,0.018813399598002,
KITTQPINIR,ph,T,29,true,"atm and atr DNA damage response",88,25561503,"MASCOT Score",32.0000000,0.9450000,,,,,-0.7600000
ITTQPINIR,ph,T,29,true,"srk2dei ABA signaling phopshoproteomics",83,23572148,"MASCOT Score",58.0000000,,,,,,-0.0019000
ITTQPINIR,ph,T,29,true,"LAXIC - ABA stress",84a,23660473,XCorr,2.1900000,0.9940000,,,,0.085572302341461,
ITTQPINIR,ph,T,29,true,"SnRK2 protein kinase substrates",85,23776212,XCorr,2.0506103,0.9940000,,,,0.01681200042367,
ITTQPINIR,ph,T,29,true,"atm and atr DNA damage response",88,25561503,"MASCOT Score",26.0000000,0.9470000,,,,,1.6600000
ITTQPINIR,ph,T,29,true,"Protein sumoylation and phosphorylation cross-talk",97,28419593,,,,,,,,
ITTQPINIR,ph,T,29,true,"TOR Kinase and ABA Receptor",100,29290610,XCorr,2.9688737,0.9896000,,,,0.00011020000238204,
ITTQPINIR,ph,T,29,true,"Phospho cell culture sucrose/TOR",109,30833711,,,0.9978830,,,,,
ITTQPINIR,ph,T,29,true,"Tissue atlas Arabidopsis - ProteomicsDB",114,32188942,"MaxQuant score",188.2900000,0.9999840,,,,3.9774300519824E-10,
SLTMPAAVSPGTPTTPTTPTTPRK,ph,S,50,true,"srk2dei ABA signaling phopshoproteomics",83,23572148,"MASCOT Score",44.0000000,,,,,,0.0026000
SLTMPAAVSPGTPTTPTTPTTPR,ph,S,50,true,"Protein sumoylation and phosphorylation cross-talk",97,28419593,,,,,,,,
SLTMPAAVSPGTPTTPTTPTTPRK,ph,T,52,true,"srk2dei ABA signaling phopshoproteomics",83,23572148,"MASCOT Score",36.0000000,,,,,,0.0002000
SLTMPAAVSPGTPTTPTTPTTPR,ph,T,52,true,"Protein sumoylation and phosphorylation cross-talk",97,28419593,,,,,,,,
SLTMPAAVSPGTPTTPTTPTTPR,ph,T,52,true,"Tissue atlas Arabidopsis - ProteomicsDB",114,32188942,"MaxQuant score",277.7900000,0.9968990,,,,0,
SLTMPAAVSPGTPTTPTTPTTPRK,ph,S,58,true,"srk2dei ABA signaling phopshoproteomics",83,23572148,"MASCOT Score",36.0000000,,,,,,0.0002000
SLTMPAAVSPGTPTTPTTPTTPR,ph,S,58,true,"Phospho cell culture sucrose/TOR",109,30833711,,,0.9922190,,,,,
SLTMPAAVSPGTPTTPTTPTTPR,ph,S,58,true,"Tissue atlas Arabidopsis - ProteomicsDB",114,32188942,"MaxQuant score",311.8700000,0.9999980,,,,0,
SLTMPAAVSPGTPTTPTTPTTPRK,ph,T,61,true,"srk2dei ABA signaling phopshoproteomics",83,23572148,"MASCOT Score",36.0000000,,,,,,0.0002000
SLTMPAAVSPGTPTTPTTPTTPR,ph,T,61,true,"Tissue atlas Arabidopsis - ProteomicsDB",114,32188942,"MaxQuant score",98.9430000,0.8311920,,,,8.8491497116094E-12,
SLTMPAAVSPGTPTTPTTPTTPRK,ph,T,69,true,"srk2dei ABA signaling phopshoproteomics",83,23572148,"MASCOT Score",63.0000000,,,,,,0.0008000
SLTMPAAVSPGTPTTPTTPTTPR,ph,T,69,true,"Tissue atlas Arabidopsis - ProteomicsDB",114,32188942,"MaxQuant score",303.0600000,0.7742400,,,,0,
SLTMPAAVSPGTPTTPTTPTTPRK,ph,T,70,true,"srk2dei ABA signaling phopshoproteomics",83,23572148,"MASCOT Score",63.0000000,,,,,,0.0008000
SVFNPGSNLATR,ph,S,85,true,"Tissue atlas Arabidopsis - ProteomicsDB",114,32188942,"MaxQuant score",76.1960000,0.9939270,,,,0.0022131099831313,
