Peptide,PTM,ModifiedAA,ModifiedPosition,PeptideUniqueToGene,ExperimentDesc,ExpID,PubmedID,ScoreType,IdentScore,LocProb,Log2FChange,PQ-val,QuantSig,PEP,MassErrorPPM
YREATNLIPSPR,ph,S,16,true,"MAPK Arabidopsis substrates",45,23172892,"MaxQuant Score",125.0300000,,,,,,
YREATNLIPSPR,ph,S,16,true,"TOR Kinase and ABA Receptor",100,29290610,XCorr,2.2381935,1.0000000,,,,0.011230000294745,
EATNLIPSPR,ph,S,16,true,"Large-scale phosphorylation discovery",44,23111157,XCorr,3.4770000,,,,,,
EATNLIPSPR,ph,S,16,true,"Chloroplast kinase substrates",60,19376835,"MASCOT Score",43.7900000,,,,,,-0.7495380
EATNLIPSPR,ph,S,16,true,"srk2dei ABA signaling phopshoproteomics",83,23572148,"MASCOT Score",25.0000000,,,,,,-0.0003000
EATNLIPSPR,ph,S,16,true,"SnRK2 protein kinase substrates",85,23776212,XCorr,2.1705155,1.0000000,,,,0.0034417898859829,
EATNLIPSPR,ph,S,16,true,"atm and atr DNA damage response",88,25561503,"MASCOT Score",30.0000000,1.0000000,,,,,-0.2000000
EATNLIPSPR,ph,S,16,true,"Protein sumoylation and phosphorylation cross-talk",97,28419593,,,,,,,,
EATNLIPSPR,ph,S,16,true,"TOR Kinase and ABA Receptor",100,29290610,XCorr,3.0130329,1.0000000,,,,0.0002641000028234,
EATNLIPSPR,ph,S,16,true,"Phospho cell culture sucrose/TOR",109,30833711,,,0.9979740,,,,,
EATNLIPSPR,ph,S,16,true,"Col-0 callus - FC Col-0 vs. Col-0 Xray",111a,31410901,,25.4700000,,0.2988585,0.0000000,NO,,-0.6870256
EATNLIPSPR,ph,S,16,true,"Col-0 X-ray callus - FC Col-0 vs. Col-0 Xray",111b,31410901,,25.4700000,,0.2988585,0.0000000,NO,,-0.6870256
EATNLIPSPR,ph,S,16,true,"atm callus - FC atm vs. atm Xray",111c,31410901,,25.4700000,,-0.4120051,0.0000000,NO,,-0.6870256
EATNLIPSPR,ph,S,16,true,"atm-3 X-ray callus - FC atm vs. atm Xray",111d,31410901,,25.4700000,,-0.4120051,0.0000000,NO,,-0.6870256
EATNLIPSPR,ph,S,16,true,"Tissue atlas Arabidopsis - ProteomicsDB",114,32188942,"MaxQuant score",182.2300000,1.0000000,,,,9.6795904624969E-10,
CHNSNNSCGMSSSSESNKPPTTPTR,ph,T,40,true,"Tissue atlas Arabidopsis - ProteomicsDB",114,32188942,"MaxQuant score",240.6400000,0.9837870,,,,0,
QVVQMLTGSAERPK,ph,S,77,true,"Tissue atlas Arabidopsis - ProteomicsDB",114,32188942,"MaxQuant score",168.0500000,0.9891790,,,,2.543430088192E-15,
INPLNPVFNPVNSAFSPR,ph,S,155,true,"STN8 phosphoproteome",38,21768351,"MASCOT Score",97.0200000,,,,,,-2.1910600
INPLNPVFNPVNSAFSPR,ph,S,155,true,"Large-scale phosphorylation discovery",44,23111157,XCorr,5.2240000,,,,,,
INPLNPVFNPVNSAFSPR,ph,S,155,true,"MAPK Arabidopsis substrates",45,23172892,"MaxQuant Score",394.4000000,,,,,,
INPLNPVFNPVNSAFSPR,ph,S,155,true,"Protein sumoylation and phosphorylation cross-talk",97,28419593,,,,,,,,
INPLNPVFNPVNSAFSPR,ph,S,155,true,"TOR Kinase and ABA Receptor",100,29290610,XCorr,5.8292356,1.0000000,,,,1.2200000121254E-8,
INPLNPVFNPVNSAFSPR,ph,S,155,true,"Lateral root-induction - NAA vs control",106,23328941,"MASCOT Score",48.0000000,,,,,,
INPLNPVFNPVNSAFSPR,ph,S,155,true,"Col-0 callus - FC Col-0 vs. Col-0 Xray",111a,31410901,,80.9300000,,0.2220024,0.0000000,NO,,0.7628507
INPLNPVFNPVNSAFSPR,ph,S,155,true,"Col-0 X-ray callus - FC Col-0 vs. Col-0 Xray",111b,31410901,,80.9300000,,0.2220024,0.0000000,NO,,0.7628507
INPLNPVFNPVNSAFSPR,ph,S,155,true,"atm callus - FC atm vs. atm Xray",111c,31410901,,80.9300000,,0.5990238,0.0000000,NO,,0.7628507
INPLNPVFNPVNSAFSPR,ph,S,155,true,"atm-3 X-ray callus - FC atm vs. atm Xray",111d,31410901,,80.9300000,,0.5990238,0.0000000,NO,,0.7628507
INPLNPVFNPVNSAFSPR,ph,S,155,true,"Tissue atlas Arabidopsis - ProteomicsDB",114,32188942,"MaxQuant score",267.6000000,0.9991180,,,,0,
INPLNPVFNPVNSAFSPR,ph,S,155,true,"Touch-induced phosphorylation: 40s touch vs untouc",136,30291188,"MASCOT score",97.8200000,,0.2228280,0.3035727,NO,,1.6302022
KPEILSPSILDFPSLVLSPVTPLIPDPFDR,ph,S,163,true,"Large-scale phosphorylation discovery",44,23111157,XCorr,6.6180000,,,,,,
KPEILSPSILDFPSLVLSPVTPLIPDPFDR,ph,S,175,true,"Large-scale phosphorylation discovery",44,23111157,XCorr,5.2340000,,,,,,
SGSSNQSPNELAAEEK,ph,S,190,true,"atm and atr DNA damage response",88,25561503,"MASCOT Score",43.0000000,0.9260000,,,,,-1.0600000
SGSSNQSPNELAAEEK,ph,S,194,true,"SnRK2 protein kinase substrates",85,23776212,XCorr,4.4871602,1.0000000,,,,0.011774700134993,
SGSSNQSPNELAAEEK,ph,S,194,true,"atm and atr DNA damage response",88,25561503,"MASCOT Score",43.0000000,0.9980000,,,,,-1.0600000
SGSSNQSPNELAAEEK,ph,S,194,true,"Protein sumoylation and phosphorylation cross-talk",97,28419593,,,,,,,,
SGSSNQSPNELAAEEK,ph,S,194,true,"TOR Kinase and ABA Receptor",100,29290610,XCorr,5.1837640,0.9973000,,,,6.9599998653302E-8,
SGSSNQSPNELAAEEK,ph,S,194,true,"Lateral root-induction - NAA vs control",106,23328941,"MASCOT Score",39.0000000,,,,,,
SGSSNQSPNELAAEEK,ph,S,194,true,"Phospho cell culture sucrose/TOR",109,30833711,,,0.9999610,,,,,
SGSSNQSPNELAAEEK,ph,S,194,true,"Col-0 callus - FC Col-0 vs. Col-0 Xray",111a,31410901,,69.6300000,,-0.8512124,0.0000000,NO,,0.8385479
SGSSNQSPNELAAEEK,ph,S,194,true,"Col-0 X-ray callus - FC Col-0 vs. Col-0 Xray",111b,31410901,,69.6300000,,-0.8512124,0.0000000,NO,,0.8385479
SGSSNQSPNELAAEEK,ph,S,194,true,"atm callus - FC atm vs. atm Xray",111c,31410901,,69.6300000,,-1.7131065,0.0000000,NO,,0.8385479
SGSSNQSPNELAAEEK,ph,S,194,true,"atm-3 X-ray callus - FC atm vs. atm Xray",111d,31410901,,69.6300000,,-1.7131065,0.0000000,NO,,0.8385479
SGSSNQSPNELAAEEK,ph,S,194,true,"Tissue atlas Arabidopsis - ProteomicsDB",114,32188942,"MaxQuant score",367.5200000,1.0000000,,,,0,
GFYLHPSPATTPMDPEPR,ph,Y,211,true,"TOR Kinase and ABA Receptor",100,29290610,XCorr,3.7922969,0.9958000,,,,0.0081280004233122,
GFYLHPSPATTPMDPEPR,ph,S,215,true,"Large-scale phosphorylation discovery",44,23111157,XCorr,3.4730000,,,,,,
GFYLHPSPATTPMDPEPR,ph,S,215,true,"SnRK2 protein kinase substrates",85,23776212,XCorr,2.4647188,0.9240000,,,,1.8843600628315E-5,
GFYLHPSPATTPMDPEPR,ph,S,215,true,"atm and atr DNA damage response",88,25561503,"MASCOT Score",29.0000000,1.0000000,,,,,-0.7100000
GFYLHPSPATTPMDPEPR,ph,S,215,true,"Phospho cell culture sucrose/TOR",109,30833711,,,0.9975670,,,,,
GFYLHPSPATTPMDPEPR,ph,S,215,true,"Tissue atlas Arabidopsis - ProteomicsDB",114,32188942,"MaxQuant score",232.1500000,0.9999970,,,,0,
GFYLHPSPATTPMDPEPR,ph,T,218,true,"Large-scale phosphorylation discovery",44,23111157,XCorr,2.7410000,,,,,,
GFYLHPSPATTPMDPEPR,ph,T,218,true,"atm and atr DNA damage response",88,25561503,"MASCOT Score",29.0000000,0.9890000,,,,,-0.7100000
GFYLHPSPATTPMDPEPR,ph,T,218,true,"Tissue atlas Arabidopsis - ProteomicsDB",114,32188942,"MaxQuant score",174.3500000,0.9630390,,,,3.723220094441E-27,
GFYLHPSPATTPMDPEPR,ph,T,219,true,"SnRK2 protein kinase substrates",85,23776212,XCorr,2.4647188,0.9300000,,,,1.8843600628315E-5,
GFYLHPSPATTPMDPEPR,ph,T,219,true,"atm and atr DNA damage response",88,25561503,"MASCOT Score",29.0000000,0.9960000,,,,,-0.6700000
GFYLHPSPATTPMDPEPR,ph,T,219,true,"TOR Kinase and ABA Receptor",100,29290610,XCorr,3.3446274,0.9948000,,,,0.0028389999642968,
GFYLHPSPATTPMDPEPR,ph,T,219,true,"Tissue atlas Arabidopsis - ProteomicsDB",114,32188942,"MaxQuant score",220.7800000,0.9999050,,,,0,
LLPLFPVTSPRVSGSSSASTS,ph,T,234,true,"MAPK Arabidopsis substrates",45,23172892,"MaxQuant Score",115.4200000,,,,,,
LLPLFPVTSPR,ph,T,234,false,"MAPK Arabidopsis substrates",45,23172892,"MaxQuant Score",99.6880000,,,,,,
LLPLFPVTSPR,ph,T,234,false,"Brassinosteroid-Regulated Phosphorylation Dynamics",94,26187819,"MaxQuant Score",156.8300000,0.9720000,,,,0.00018810000619851,1.5500000
LLPLFPVTSPR,ph,T,234,false,"Lateral root-induction - NAA vs control",106,23328941,"MASCOT Score",22.0000000,,,,,,
LLPLFPVTSPR,ph,T,234,false,"Col-0 callus - FC Col-0 vs. Col-0 Xray",111a,31410901,,51.9500000,,0.0164294,0.0000000,NO,,-0.0865370
LLPLFPVTSPR,ph,T,234,false,"Col-0 X-ray callus - FC Col-0 vs. Col-0 Xray",111b,31410901,,51.9500000,,0.0164294,0.0000000,NO,,-0.0865370
LLPLFPVTSPR,ph,T,234,false,"atm callus - FC atm vs. atm Xray",111c,31410901,,51.9500000,,-0.0989983,0.0000000,NO,,-0.0865370
LLPLFPVTSPR,ph,T,234,false,"atm-3 X-ray callus - FC atm vs. atm Xray",111d,31410901,,51.9500000,,-0.0989983,0.0000000,NO,,-0.0865370
LLPLFPVTSPR,ph,T,234,false,"Tissue atlas Arabidopsis - ProteomicsDB",114,32188942,"MaxQuant score",165.5800000,0.8536250,,,,7.6523502812176E-11,
LLPLFPVTSPRVSGSSSASTS,ph,S,235,true,"MAPK Arabidopsis substrates",45,23172892,"MaxQuant Score",102.0800000,,,,,,
LLPLFPVTSPR,ph,S,235,false,"Large-scale phosphorylation discovery",44,23111157,XCorr,3.1010000,,,,,,
LLPLFPVTSPR,ph,S,235,false,"MAPK Arabidopsis substrates",45,23172892,"MaxQuant Score",176.9500000,,,,,,
LLPLFPVTSPR,ph,S,235,false,"Phosphoproteome ethylene-regulated time response",46,24043427,"MASCOT Score",36.9900000,,,,,,17.5098000
LLPLFPVTSPR,ph,S,235,false,"SnRK2 protein kinase substrates",85,23776212,XCorr,2.4402554,0.9650000,,,,2.2283000362222E-5,
LLPLFPVTSPR,ph,S,235,false,"Brassinosteroid-Regulated Phosphorylation Dynamics",94,26187819,"MaxQuant Score",156.8300000,0.8240000,,,,3.3749998692656E-5,1.0870000
LLPLFPVTSPR,ph,S,235,false,"Lateral root-induction - NAA vs control",106,23328941,"MASCOT Score",35.0000000,,,,,,
LLPLFPVTSPR,ph,S,235,false,"Tissue atlas Arabidopsis - ProteomicsDB",114,32188942,"MaxQuant score",161.4800000,0.8387250,,,,9.5010402323403E-11,
