Peptide,PTM,ModifiedAA,ModifiedPosition,PeptideUniqueToGene,ExperimentDesc,ExpID,PubmedID,ScoreType,IdentScore,LocProb,Log2FChange,PQ-val,QuantSig,PEP,MassErrorPPM
DRDSSPDHSPQR,ph,S,18,true,"atm and atr DNA damage response",88,25561503,"MASCOT Score",45.0000000,1.0000000,,,,,-1.0500000
DRDSSPDHSPQR,ph,S,18,true,"Tissue atlas Arabidopsis - ProteomicsDB",114,32188942,"MaxQuant score",81.3460000,1.0000000,,,,0.0055353501811624,
DDRDRDSSPDHSPQR,ph,S,19,true,"atm and atr DNA damage response",88,25561503,"MASCOT Score",38.0000000,0.9950000,,,,,-0.0200000
DRDSSPDHSPQR,ph,S,19,true,"atm and atr DNA damage response",88,25561503,"MASCOT Score",45.0000000,1.0000000,,,,,-1.0500000
DRDSSPDHSPQR,ph,S,19,true,"Tissue atlas Arabidopsis - ProteomicsDB",114,32188942,"MaxQuant score",81.3460000,1.0000000,,,,0.0055353501811624,
DDRDRDSSPDHSPQR,ph,S,23,true,"atm and atr DNA damage response",88,25561503,"MASCOT Score",29.0000000,1.0000000,,,,,0.1700000
DRDSSPDHSPQR,ph,S,23,true,"atm and atr DNA damage response",88,25561503,"MASCOT Score",39.0000000,1.0000000,,,,,0.1500000
DRDSSPDHSPQR,ph,S,23,true,"Tissue atlas Arabidopsis - ProteomicsDB",114,32188942,"MaxQuant score",81.3460000,1.0000000,,,,0.0055353501811624,
SHEGSKEKESR,nt,S,88,true,"Arabidopsis translation initiation landscape - NT",167b,35069635,,,,,,,,
VSSISTTDENK,ph,S,185,true,"atm and atr DNA damage response",88,25561503,"MASCOT Score",29.0000000,0.9340000,,,,,0.4600000
VSSISTTDENK,ph,S,185,true,"Tissue atlas Arabidopsis - ProteomicsDB",114,32188942,"MaxQuant score",140.1400000,0.9998510,,,,7.58834971748E-7,
SSANLPLDSSALAAK,ph,S,228,true,"Tissue atlas Arabidopsis - ProteomicsDB",114,32188942,"MaxQuant score",195.2000000,0.9788260,,,,2.6888900629182E-34,
ATKPTSEGSPHTR,ph,S,265,true,"Tissue atlas Arabidopsis - ProteomicsDB",114,32188942,"MaxQuant score",85.6360000,0.9305440,,,,0.00013901399506722,
FHVHECVTESTAK,so,C,758,true,"Arabidopsis S-sulfenylation chemoproteomics",108,31578252,"pFind PSM Score",0.0259364,,2.6315800,,,,-1.4439956
