Peptide,PTM,ModifiedAA,ModifiedPosition,PeptideUniqueToGene,ExperimentDesc,ExpID,PubmedID,ScoreType,IdentScore,LocProb,Log2FChange,PQ-val,QuantSig,PEP,MassErrorPPM
SQMDPDAVSKAFVEHYY,nt,S,2,true,"Arg/N-end rule seed, prt6 vs. Wt",99,29168982,"MASCOT Score",33.7700000,,,,,0.0062890001572669,-0.5405967
SQMDPDAVSKAFVEH,nt,S,2,true,"Arg/N-end rule seed, prt6 vs. Wt",99,29168982,"MASCOT Score",67.4600000,,,,,0.00021019999985583,-7.9339503
SQMDPDAVSKAFVE,nt,S,2,true,"Arg/N-end rule seed, prt6 vs. Wt",99,29168982,"MASCOT Score",41.4400000,,,,,7.0930002493697E-7,2.7221491
SQMDPDAVSKAF,nt,S,2,true,"Arg/N-end rule seed, prt6 vs. Wt",99,29168982,"MASCOT Score",48.8400000,,,,,0.029020000249147,-1.6750022
SQMDPDAVSKA,nt,S,2,true,"Arg/N-end rule seed, prt6 vs. Wt",99,29168982,"MASCOT Score",56.1100000,,,,,0.032499998807907,-2.4100981
SQMDPDAVSK,nt,S,2,true,"N-terminal ChaFRADIC",92,26010716,"MASCOT Score",50.7400000,,,,,0.0029070000164211,
SQMDPDAVSKAFVEHYYSTFDTNR,nta,S,2,true,"HUNTER N-terminome: legumain, GluC and trypsin",119,31951383,"MaxQuant score",67.9920000,,,,,,
SQMDPDAVSKAFVEHYYSTFDTNR,nta,S,2,true,"Arabidopsis translation initiation landscape - NTA",167a,35069635,,,,,,,,
SQMDPDAVSKAFVEHYYSTFDTN,nta,S,2,true,"HUNTER N-terminome: legumain, GluC and trypsin",119,31951383,"MaxQuant score",,,,,,,
SQMDPDAVSKAFVEHYY,nta,S,2,true,"Arg/N-end rule pathway Roots",80,25728785,"MASCOT Score",43.1600000,,,,,4.3870000808965E-5,
SQMDPDAVSKAFVEHYY,nta,S,2,true,"Arg/N-end rule seed, prt6 vs. Wt",99,29168982,"MASCOT Score",33.7700000,,-0.4359744,0.3276076,NO,0.0062890001572669,-0.5405967
SQMDPDAVSKAFVEH,nta,S,2,true,"Arg/N-end rule seed, prt6 vs. Wt",99,29168982,"MASCOT Score",67.4600000,,-0.2334527,0.3543394,NO,0.00021019999985583,-7.9339503
SQMDPDAVSKAFVE,nta,S,2,true,"Arg/N-end rule seed, prt6 vs. Wt",99,29168982,"MASCOT Score",41.4400000,,-0.3990132,0.5009442,NO,7.0930002493697E-7,2.7221491
SQMDPDAVSKAFVE,nta,S,2,true,"HUNTER N-terminome: legumain, GluC and trypsin",119,31951383,"MaxQuant score",65.8420000,,,,,,
SQMDPDAVSKAF,nta,S,2,true,"Arg/N-end rule seed, prt6 vs. Wt",99,29168982,"MASCOT Score",48.8400000,,-0.0027577,0.9647335,NO,0.029020000249147,-1.6750022
SQMDPDAVSKA,nta,S,2,true,"Arg/N-end rule seed, prt6 vs. Wt",99,29168982,"MASCOT Score",56.1100000,,-0.1887536,0.3368483,NO,0.032499998807907,-2.4100981
SQMDPDAVSK,nta,S,2,true,"Characterization plant N-terminal acetylation",6,22223895,"MASCOT Score",58.6500000,,,,,,
SQMDPDAVSK,nta,S,2,true,"N-terminal ChaFRADIC",92,26010716,"MASCOT Score",50.7400000,,,,,0.0029070000164211,
SQMDPDAVSK,ph,S,2,true,"atm and atr DNA damage response",88,25561503,"MASCOT Score",24.0000000,1.0000000,,,,,0.0200000
SQMDPDAVSK,ph,S,2,true,"Tissue atlas Arabidopsis - ProteomicsDB",114,32188942,"MaxQuant score",59.9760000,0.9999940,,,,0.0020938098896295,
MDPDAVSKAFVEHYY,nta,M,4,true,"Arabidopsis translation initiation landscape - NTA",167a,35069635,,,,,,,,
SQMDPDAVSKAFVEHYYSTFDTNR,ub,K,11,true,"upl3 mutant / wildtype",168,35926874,"MaxQuant score",131.7700000,1.0000000,0.1388145,0.8913400,NO,2.7458800550982E-24,1.1800000
IQGVQSIVAK,ph,S,50,true,"Tissue atlas Arabidopsis - ProteomicsDB",114,32188942,"MaxQuant score",76.3320000,1.0000000,,,,0.0038581499829888,
LTSLPFQQCK,acy,C,63,true,"Arabidopsis S-acylation atlas - Meristem",163a,35681017,,,,,,,,
LTSLPFQQCK,sno,C,63,true,"Site-specific nitrosomeproteomic id - gsnor1-3",90a,25699590,XCorr,2.1208420,,,,,0.0036490000784397,-6.3758832
LTSLPFQQCK,sno,C,63,true,"hot5-4 / wildtype, FAT-switch S-nitrosoproteome",169,37277371,,,,0.7962381,0.0000689,YES,,
LTSLPFQQCK,so,C,63,true,"Arabidopsis S-sulfenylation chemoproteomics",108,31578252,"pFind PSM Score",0.3419200,,0.9708700,,,,0.2026738
LTSLPFQQCK,so,C,63,true,"S-sulfenylation site detection using YAP1C",110,32714340,,,,,,,,
HHISTVDCQPSGPASGMLVFVSGNLQLAGEEHALK,so,C,72,true,"S-sulfenylation site detection using YAP1C",110,32714340,,,,,,,,
