Peptide,PTM,ModifiedAA,ModifiedPosition,PeptideUniqueToGene,ExperimentDesc,ExpID,PubmedID,ScoreType,IdentScore,LocProb,Log2FChange,PQ-val,QuantSig,PEP,MassErrorPPM
PPSPALR,ph,S,4,true,"Lateral root-induction - NAA vs control",106,23328941,"MASCOT Score",27.0000000,,,,,,
PPSPALR,ph,S,4,true,"Tissue atlas Arabidopsis - ProteomicsDB",114,32188942,"MaxQuant score",122.5400000,1.0000000,,,,0.012814999558032,
RGHSIEYGILFR,ph,S,25,true,"atm and atr DNA damage response",88,25561503,"MASCOT Score",57.0000000,1.0000000,,,,,0.4100000
RGHSIEYGILFR,ph,S,25,true,"TOR Kinase and ABA Receptor",100,29290610,XCorr,4.3190470,1.0000000,,,,1.3310000213096E-6,
GHSIEYGILFR,ph,S,25,true,"Arabidopsis root NAA phosphoproteome",18a,27643528,"MaxQuant Score",60.1570000,1.0000000,,,,7.6390002504922E-5,-0.1620000
GHSIEYGILFR,ph,S,25,true,"STN8 phosphoproteome",38,21768351,"MASCOT Score",63.5200000,,,,,,-1.1666300
GHSIEYGILFR,ph,S,25,true,"srk2dei ABA signaling phopshoproteomics",83,23572148,"MASCOT Score",51.0000000,,,,,,0.0002000
GHSIEYGILFR,ph,S,25,true,"atm and atr DNA damage response",88,25561503,"MASCOT Score",22.0000000,1.0000000,,,,,0.1100000
GHSIEYGILFR,ph,S,25,true,"TOR Kinase and ABA Receptor",100,29290610,XCorr,3.8313568,1.0000000,,,,8.7239995991695E-6,
GHSIEYGILFR,ph,S,25,true,"Lateral root-induction - NAA vs control",106,23328941,"MASCOT Score",49.0000000,,,,,,
GHSIEYGILFR,ph,S,25,true,"Phospho cell culture sucrose/TOR",109,30833711,,,0.9999130,,,,,
GHSIEYGILFR,ph,S,25,true,"Tissue atlas Arabidopsis - ProteomicsDB",114,32188942,"MaxQuant score",218.6200000,1.0000000,,,,2.0240600658571E-32,
GHSIEYGILFR,ph,Y,28,true,"srk2dei ABA signaling phopshoproteomics",83,23572148,"MASCOT Score",21.0000000,,,,,,-0.0002000
HFSEFTIPVQGESSR,ph,S,83,true,"Tissue atlas Arabidopsis - ProteomicsDB",114,32188942,"MaxQuant score",190.2400000,0.9802690,,,,4.8567900092924E-34,
NDYDWLLTPPDTPLFPSLDDQPPAASVVR,ph,T,105,true,"TOR Kinase and ABA Receptor",100,29290610,XCorr,4.8034291,0.9667000,,,,4.7610001274734E-6,
GRPQSQISLSR,ph,S,131,true,"atm and atr DNA damage response",88,25561503,"MASCOT Score",33.0000000,0.9940000,,,,,0.1400000
GRPQSQISLSR,ph,S,131,true,"TOR Kinase and ABA Receptor",100,29290610,XCorr,2.7945819,0.9993000,,,,0.056340001523495,
GRPQSQISLSR,ph,S,131,true,"Tissue atlas Arabidopsis - ProteomicsDB",114,32188942,"MaxQuant score",72.7050000,0.9928170,,,,0.0012865900062025,
GRPQSQISLSR,ph,S,133,true,"atm and atr DNA damage response",88,25561503,"MASCOT Score",49.0000000,1.0000000,,,,,-0.2000000
GRPQSQISLSR,ph,S,133,true,"Tissue atlas Arabidopsis - ProteomicsDB",114,32188942,"MaxQuant score",73.8870000,0.9784080,,,,0.00054891797481105,
RISPTPGKPSGPVSR,ph,S,192,true,"srk2dei ABA signaling phopshoproteomics",83,23572148,"MASCOT Score",31.0000000,,,,,,-0.0003000
RISPTPGKPSGPVSR,ph,S,192,true,"atm and atr DNA damage response",88,25561503,"MASCOT Score",35.0000000,0.9990000,,,,,0.4600000
RISPTPGKPSGPVSR,ph,S,192,true,"TOR Kinase and ABA Receptor",100,29290610,XCorr,2.6614592,0.9009000,,,,0.0026489999145269,
RISPTPGKPSGPVSR,ph,S,192,true,"Col-0 callus - FC Col-0 vs. Col-0 Xray",111a,31410901,,28.0400000,,0.4733407,0.0000000,NO,,0.3724541
RISPTPGKPSGPVSR,ph,S,192,true,"Col-0 X-ray callus - FC Col-0 vs. Col-0 Xray",111b,31410901,,28.0400000,,0.4733407,0.0000000,NO,,0.3724541
RISPTPGKPSGPVSR,ph,S,192,true,"atm callus - FC atm vs. atm Xray",111c,31410901,,28.0400000,,-1.9536193,0.0000000,NO,,0.3724541
RISPTPGKPSGPVSR,ph,S,192,true,"atm-3 X-ray callus - FC atm vs. atm Xray",111d,31410901,,28.0400000,,-1.9536193,0.0000000,NO,,0.3724541
RISPTPGKPSGPVSR,ph,S,192,true,"Tissue atlas Arabidopsis - ProteomicsDB",114,32188942,"MaxQuant score",56.7190000,0.9803220,,,,0.0010813999688253,
ISPTPGKPSGPVSR,ph,T,194,true,"atm and atr DNA damage response",88,25561503,"MASCOT Score",25.0000000,0.9900000,,,,,0.6300000
RISPTPGKPSGPVSR,ph,S,203,true,"atm and atr DNA damage response",88,25561503,"MASCOT Score",27.0000000,1.0000000,,,,,-2.3100000
RISPTPGKPSGPVSR,ph,S,203,true,"Tissue atlas Arabidopsis - ProteomicsDB",114,32188942,"MaxQuant score",81.7260000,0.7696450,,,,1.4715200222781E-6,
RMSTGSTTMASPAVR,ph,S,214,true,"Tissue atlas Arabidopsis - ProteomicsDB",114,32188942,"MaxQuant score",62.8610000,0.9823570,,,,0.00091709400294349,
MSTGSTTMASPAVR,ph,S,222,true,"Tissue atlas Arabidopsis - ProteomicsDB",114,32188942,"MaxQuant score",117.4800000,0.9977650,,,,2.0076700820937E-5,
TSLGDRPASYVR,ph,S,264,true,"atm and atr DNA damage response",88,25561503,"MASCOT Score",20.0000000,0.9920000,,,,,0.0200000
KSVSPSASR,ph,S,294,true,"atm and atr DNA damage response",88,25561503,"MASCOT Score",21.0000000,1.0000000,,,,,-1.8300000
KSVSPSASR,ph,S,296,true,"atm and atr DNA damage response",88,25561503,"MASCOT Score",24.0000000,0.9940000,,,,,-2.0500000
RASLSPNSR,ph,S,350,true,"atm and atr DNA damage response",88,25561503,"MASCOT Score",50.0000000,1.0000000,,,,,0.2300000
RASLSPNSR,ph,S,350,true,"Tissue atlas Arabidopsis - ProteomicsDB",114,32188942,"MaxQuant score",64.6500000,0.9999810,,,,0.01228279992938,
RASLSPNSR,ph,S,352,true,"atm and atr DNA damage response",88,25561503,"MASCOT Score",50.0000000,1.0000000,,,,,0.2300000
RASLSPNSR,ph,S,352,true,"TOR Kinase and ABA Receptor",100,29290610,XCorr,2.8568265,0.9904000,,,,0.0049700001254678,
ASLSPNSR,ph,S,352,true,"atm and atr DNA damage response",88,25561503,"MASCOT Score",30.0000000,1.0000000,,,,,0.8800000
ASLSPNSR,ph,S,352,true,"Tissue atlas Arabidopsis - ProteomicsDB",114,32188942,"MaxQuant score",120.4500000,0.9999940,,,,0.0029728200752288,
LLSPGSAPR,ph,S,365,true,"atm and atr DNA damage response",88,25561503,"MASCOT Score",52.0000000,1.0000000,,,,,-0.6700000
LLSPGSAPR,ph,S,365,true,"TOR Kinase and ABA Receptor",100,29290610,XCorr,2.3838487,1.0000000,,,,0.014080000109971,
LLSPGSAPR,ph,S,365,true,"Tissue atlas Arabidopsis - ProteomicsDB",114,32188942,"MaxQuant score",129.8800000,1.0000000,,,,0.00012877500557806,
LLSPGSAPR,ph,S,368,true,"Tissue atlas Arabidopsis - ProteomicsDB",114,32188942,"MaxQuant score",81.9200000,1.0000000,,,,0.0031966799870133,
PLASSLPSTGIYSGK,ph,S,397,true,"Tissue atlas Arabidopsis - ProteomicsDB",114,32188942,"MaxQuant score",142.4500000,0.9938820,,,,5.7320400371703E-17,
GSSSYHHIMLR,ph,S,411,true,"Tissue atlas Arabidopsis - ProteomicsDB",114,32188942,"MaxQuant score",45.1150000,0.8105450,,,,0.014011300168931,
EEHSFVETDSPGTNSPK,ph,S,578,true,"LAXIC - mannitol vs control",84b,23660473,XCorr,2.8900000,0.9410000,,,,3.8599998752886E-9,
EEHSFVETDSPGTNSPK,ph,S,578,true,"SnRK2 protein kinase substrates",85,23776212,XCorr,3.2420497,0.9990000,,,,6.4766700234031E-6,
EEHSFVETDSPGTNSPK,ph,S,578,true,"Lateral root-induction - NAA vs control",106,23328941,"MASCOT Score",23.0000000,,,,,,
EEHSFVETDSPGTNSPK,ph,S,578,true,"Tissue atlas Arabidopsis - ProteomicsDB",114,32188942,"MaxQuant score",380.7100000,0.9998840,,,,0,
EEHSFVETDSPGTNSPK,ph,T,581,true,"Lateral root-induction - NAA vs control",106,23328941,"MASCOT Score",38.0000000,,,,,,
EEHSFVETDSPGTNSPK,ph,T,581,true,"Tissue atlas Arabidopsis - ProteomicsDB",114,32188942,"MaxQuant score",263.2000000,0.9026240,,,,0,
EEHSFVETDSPGTNSPK,ph,S,583,true,"Large-scale phosphorylation discovery",44,23111157,XCorr,4.5540000,,,,,,
EEHSFVETDSPGTNSPK,ph,S,583,true,"LAXIC - mannitol vs control",84b,23660473,XCorr,2.8900000,0.9720000,,,,3.8599998752886E-9,
EEHSFVETDSPGTNSPK,ph,S,583,true,"SnRK2 protein kinase substrates",85,23776212,XCorr,3.2420497,0.9990000,,,,6.4766700234031E-6,
EEHSFVETDSPGTNSPK,ph,S,583,true,"atm and atr DNA damage response",88,25561503,"MASCOT Score",61.0000000,1.0000000,,,,,-0.5500000
EEHSFVETDSPGTNSPK,ph,S,583,true,"TOR Kinase and ABA Receptor",100,29290610,XCorr,4.7291179,0.9814000,,,,7.0879997338125E-7,
EEHSFVETDSPGTNSPK,ph,S,583,true,"Tissue atlas Arabidopsis - ProteomicsDB",114,32188942,"MaxQuant score",380.7100000,0.9975030,,,,0,
HHDVNIGSLGR,ph,S,694,true,"Tissue atlas Arabidopsis - ProteomicsDB",114,32188942,"MaxQuant score",65.2120000,1.0000000,,,,0.0015688700368628,
SVSMKSPVIQANNSSCFTR,ph,S,709,true,"Tissue atlas Arabidopsis - ProteomicsDB",114,32188942,"MaxQuant score",204.2300000,0.9983210,,,,0,
SVSMKSPVIQANNSSCFTR,ph,S,712,true,"Tissue atlas Arabidopsis - ProteomicsDB",114,32188942,"MaxQuant score",77.3910000,0.9980330,,,,4.0118698962033E-5,
SYEGFSYSR,ph,S,726,true,"Tissue atlas Arabidopsis - ProteomicsDB",114,32188942,"MaxQuant score",117.5200000,0.9999450,,,,0.00034128600964323,
SYEGFSYSR,ph,S,731,true,"Tissue atlas Arabidopsis - ProteomicsDB",114,32188942,"MaxQuant score",104.7900000,0.9322650,,,,0.00078119902173057,
SYEGFSYSR,ph,S,733,true,"Tissue atlas Arabidopsis - ProteomicsDB",114,32188942,"MaxQuant score",91.9610000,0.7542750,,,,0.0020823699887842,
QRSGSTLDLETHR,ph,S,769,true,"atm and atr DNA damage response",88,25561503,"MASCOT Score",54.0000000,1.0000000,,,,,-0.4900000
SGSTLDLETHR,ph,S,769,true,"Large-scale phosphorylation discovery",44,23111157,XCorr,2.8080000,,,,,,
SGSTLDLETHR,ph,S,769,true,"atm and atr DNA damage response",88,25561503,"MASCOT Score",47.0000000,1.0000000,,,,,-0.1000000
SGSTLDLETHR,ph,S,769,true,"TOR Kinase and ABA Receptor",100,29290610,XCorr,2.1095014,0.9971000,,,,0.008822999894619,
SGSTLDLETHR,ph,S,769,true,"Lateral root-induction - NAA vs control",106,23328941,"MASCOT Score",30.0000000,,,,,,
SGSTLDLETHR,ph,S,769,true,"Tissue atlas Arabidopsis - ProteomicsDB",114,32188942,"MaxQuant score",298.8400000,0.9994930,,,,0,
QRSGSTLDLETHR,ph,S,771,true,"atm and atr DNA damage response",88,25561503,"MASCOT Score",48.0000000,1.0000000,,,,,-0.1400000
SGSTLDLETHR,ph,S,771,true,"atm and atr DNA damage response",88,25561503,"MASCOT Score",39.0000000,0.9950000,,,,,-0.5400000
SGSTLDLETHR,ph,S,771,true,"Lateral root-induction - NAA vs control",106,23328941,"MASCOT Score",34.0000000,,,,,,
SGSTLDLETHR,ph,S,771,true,"Tissue atlas Arabidopsis - ProteomicsDB",114,32188942,"MaxQuant score",204.3400000,0.9879590,,,,2.0540099926046E-24,
SGSTLDLETHRYDTNSK,fuc,T,782,true,"SPINDLY O-fucosylation",162,36739885,,,,,,,1.2000000476837,
GETRESPAHIR,ph,T,895,true,"atm and atr DNA damage response",88,25561503,"MASCOT Score",33.0000000,0.9140000,,,,,-0.3600000
GETRESPAHIR,ph,T,895,true,"Tissue atlas Arabidopsis - ProteomicsDB",114,32188942,"MaxQuant score",84.2970000,0.8291160,,,,0.00034402898745611,
GETRESPAHIR,ph,S,898,true,"atm and atr DNA damage response",88,25561503,"MASCOT Score",35.0000000,0.9250000,,,,,1.2200000
GETRESPAHIR,ph,S,898,true,"Tissue atlas Arabidopsis - ProteomicsDB",114,32188942,"MaxQuant score",174.4700000,0.9999650,,,,1.5946700340427E-12,
STSDLGASPITDDCPFNDHSR,ph,S,904,true,"Large-scale phosphorylation discovery",44,23111157,XCorr,3.4250000,,,,,,
STSDLGASPITDDCPFNDHSR,ph,S,904,true,"Lateral root-induction - NAA vs control",106,23328941,"MASCOT Score",33.0000000,,,,,,
STSDLGASPITDDCPFNDHSR,ph,S,906,true,"srk2dei ABA signaling phopshoproteomics",83,23572148,"MASCOT Score",64.0000000,,,,,,0.0007000
STSDLGASPITDDCPFNDHSR,ph,S,906,true,"TOR Kinase and ABA Receptor",100,29290610,XCorr,3.4903893,0.8200000,,,,6.3269999373006E-6,
STSDLGASPITDDCPFNDHSR,ph,S,906,true,"Col-0 callus - FC Col-0 vs. Col-0 Xray",111a,31410901,,33.7000000,,0.9127410,0.0000000,NO,,1.9213162
STSDLGASPITDDCPFNDHSR,ph,S,906,true,"Col-0 X-ray callus - FC Col-0 vs. Col-0 Xray",111b,31410901,,33.7000000,,0.9127410,0.0000000,NO,,1.9213162
STSDLGASPITDDCPFNDHSR,ph,S,906,true,"atm callus - FC atm vs. atm Xray",111c,31410901,,33.7000000,,0.8635783,0.0000000,NO,,1.9213162
STSDLGASPITDDCPFNDHSR,ph,S,906,true,"atm-3 X-ray callus - FC atm vs. atm Xray",111d,31410901,,33.7000000,,0.8635783,0.0000000,NO,,1.9213162
STSDLGASPITDDCPFNDHSR,ph,S,906,true,"Tissue atlas Arabidopsis - ProteomicsDB",114,32188942,"MaxQuant score",344.6200000,0.9999070,,,,0,
STSDLGASPITDDCPFNDHSR,ph,S,911,true,"Tissue atlas Arabidopsis - ProteomicsDB",114,32188942,"MaxQuant score",60.9430000,0.9178020,,,,4.7326098865597E-5,
NLNAVDDCSEK,ph,S,977,true,"Tissue atlas Arabidopsis - ProteomicsDB",114,32188942,"MaxQuant score",95.3460000,1.0000000,,,,0.00011742700007744,
