Peptide,PTM,ModifiedAA,ModifiedPosition,PeptideUniqueToGene,ExperimentDesc,ExpID,PubmedID,ScoreType,IdentScore,LocProb,Log2FChange,PQ-val,QuantSig,PEP,MassErrorPPM
ACAEQPIKKR,nta,A,2,true,"Arabidopsis translation initiation landscape - NTA",167a,35069635,,,,,,,,
NIKLEDCQMDSDEDDYGK,ph,S,397,true,"Tissue atlas Arabidopsis - ProteomicsDB",114,32188942,"MaxQuant score",185.2300000,1.0000000,,,,0,
LEDCQMDSDEDDYGK,ph,S,397,true,"Tyrosine phosphorylation in Arabidopsis",59,18463617,"MASCOT Score",67.0000000,,,,,,-0.5793678
LEDCQMDSDEDDYGK,ph,S,397,true,"srk2dei ABA signaling phopshoproteomics",83,23572148,"MASCOT Score",70.0000000,,,,,,-0.0003000
LEDCQMDSDEDDYGK,ph,S,397,true,"atm and atr DNA damage response",88,25561503,"MASCOT Score",59.0000000,1.0000000,,,,,0.2000000
FSVSHVKPHSSADNDVR,ph,S,415,true,"Tissue atlas Arabidopsis - ProteomicsDB",114,32188942,"MaxQuant score",137.8700000,0.7679780,,,,9.6213099987086E-11,
SSAGSVYDAGGSR,ph,S,422,true,"atm and atr DNA damage response",88,25561503,"MASCOT Score",47.0000000,0.9910000,,,,,0.3200000
SSAGSVYDAGGSR,ph,S,423,true,"atm and atr DNA damage response",88,25561503,"MASCOT Score",41.0000000,0.9840000,,,,,-0.3200000
SSAGSVYDAGGSR,ph,S,426,true,"atm and atr DNA damage response",88,25561503,"MASCOT Score",47.0000000,0.9830000,,,,,0.3200000
SMDFETVDQR,ph,S,435,true,"Tyrosine phosphorylation in Arabidopsis",59,18463617,"MASCOT Score",25.0000000,,,,,,-1.7604453
SMDFETVDQR,ph,S,435,true,"atm and atr DNA damage response",88,25561503,"MASCOT Score",49.0000000,1.0000000,,,,,-0.2200000
SMDFETVDQR,ph,S,435,true,"Tissue atlas Arabidopsis - ProteomicsDB",114,32188942,"MaxQuant score",184.3600000,1.0000000,,,,2.0472200323862E-10,
GLLNQHTPSPSAR,ph,T,462,true,"srk2dei ABA signaling phopshoproteomics",83,23572148,"MASCOT Score",23.0000000,,,,,,-0.0008000
GLLNQHTPSPSAR,ph,T,462,true,"SnRK2 protein kinase substrates",85,23776212,XCorr,2.8994176,1.0000000,,,,0.016220200806856,
GLLNQHTPSPSAR,ph,T,462,true,"atm and atr DNA damage response",88,25561503,"MASCOT Score",45.0000000,1.0000000,,,,,0.1400000
GLLNQHTPSPSAR,ph,T,462,true,"TOR Kinase and ABA Receptor",100,29290610,XCorr,2.3614311,0.9995000,,,,0.068580001592636,
GLLNQHTPSPSAR,ph,T,462,true,"Col-0 callus - FC Col-0 vs. Col-0 Xray",111a,31410901,,34.0700000,,1.0922295,0.0415741,YES,,0.8548672
GLLNQHTPSPSAR,ph,T,462,true,"Col-0 X-ray callus - FC Col-0 vs. Col-0 Xray",111b,31410901,,34.0700000,,1.0922295,0.0415741,YES,,0.8548672
GLLNQHTPSPSAR,ph,T,462,true,"atm callus - FC atm vs. atm Xray",111c,31410901,,34.0700000,,0.5206603,0.1982598,NO,,0.8548672
GLLNQHTPSPSAR,ph,T,462,true,"atm-3 X-ray callus - FC atm vs. atm Xray",111d,31410901,,34.0700000,,0.5206603,0.1982598,NO,,0.8548672
GLLNQHTPSPSAR,ph,T,462,true,"Tissue atlas Arabidopsis - ProteomicsDB",114,32188942,"MaxQuant score",222.0700000,1.0000000,,,,0,
GLLNQHTPSPSAR,ph,S,464,true,"Large-scale phosphorylation discovery",44,23111157,XCorr,2.9210000,,,,,,
GLLNQHTPSPSAR,ph,S,464,true,"srk2dei ABA signaling phopshoproteomics",83,23572148,"MASCOT Score",23.0000000,,,,,,-0.0008000
GLLNQHTPSPSAR,ph,S,464,true,"SnRK2 protein kinase substrates",85,23776212,XCorr,2.8994176,0.9920000,,,,0.016220200806856,
GLLNQHTPSPSAR,ph,S,464,true,"atm and atr DNA damage response",88,25561503,"MASCOT Score",45.0000000,0.9920000,,,,,0.1400000
GLLNQHTPSPSAR,ph,S,464,true,"TOR Kinase and ABA Receptor",100,29290610,XCorr,2.3614311,0.8873000,,,,0.068580001592636,
GLLNQHTPSPSAR,ph,S,464,true,"Phospho cell culture sucrose/TOR",109,30833711,,,0.9932860,,,,,
GLLNQHTPSPSAR,ph,S,464,true,"Col-0 callus - FC Col-0 vs. Col-0 Xray",111a,31410901,,34.0700000,,1.0922295,0.0415741,YES,,0.8548672
GLLNQHTPSPSAR,ph,S,464,true,"Col-0 X-ray callus - FC Col-0 vs. Col-0 Xray",111b,31410901,,34.0700000,,1.0922295,0.0415741,YES,,0.8548672
GLLNQHTPSPSAR,ph,S,464,true,"atm callus - FC atm vs. atm Xray",111c,31410901,,34.0700000,,0.5206603,0.1982598,NO,,0.8548672
GLLNQHTPSPSAR,ph,S,464,true,"atm-3 X-ray callus - FC atm vs. atm Xray",111d,31410901,,34.0700000,,0.5206603,0.1982598,NO,,0.8548672
GLLNQHTPSPSAR,ph,S,464,true,"Tissue atlas Arabidopsis - ProteomicsDB",114,32188942,"MaxQuant score",222.0700000,0.9999610,,,,0,
GLLNQHTPSPSAR,ph,S,466,true,"atm and atr DNA damage response",88,25561503,"MASCOT Score",24.0000000,1.0000000,,,,,-0.6900000
FHLASINRPLPHEDGGSHPER,ph,S,678,true,"Tissue atlas Arabidopsis - ProteomicsDB",114,32188942,"MaxQuant score",72.5660000,0.9999230,,,,9.5996101663332E-6,
YIIGSPEPVQWPVK,ph,S,960,true,"TOR Kinase and ABA Receptor",100,29290610,XCorr,3.8310349,1.0000000,,,,0.00015880000137258,
