Peptide,PTM,ModifiedAA,ModifiedPosition,PeptideUniqueToGene,ExperimentDesc,ExpID,PubmedID,ScoreType,IdentScore,LocProb,Log2FChange,PQ-val,QuantSig,PEP,MassErrorPPM
RTLSPMYHDR,ph,S,9,true,"atm and atr DNA damage response",88,25561503,"MASCOT Score",25.0000000,0.9510000,,,,,0.8600000
RTLSPMYHDR,ph,S,9,true,"TOR Kinase and ABA Receptor",100,29290610,XCorr,3.2861650,0.9460000,,,,2.9790000553476E-5,
TLSPMYHDR,ph,S,9,true,"Chloroplast kinase substrates",60,19376835,"MASCOT Score",38.5500000,,,,,,-0.2617210
TLSPMYHDR,ph,S,9,true,"atm and atr DNA damage response",88,25561503,"MASCOT Score",37.0000000,0.9560000,,,,,-0.1500000
TLSPMYHDR,ph,S,9,true,"Tissue atlas Arabidopsis - ProteomicsDB",114,32188942,"MaxQuant score",139.8600000,0.9999990,,,,8.6303698481061E-5,
SHENGGSHKGFTIGGSSSK,ph,S,22,true,"Tissue atlas Arabidopsis - ProteomicsDB",114,32188942,"MaxQuant score",64.2890000,0.9988300,,,,0.00013524299720302,
HNSSQFLSYLTK,ph,S,37,true,"atm and atr DNA damage response",88,25561503,"MASCOT Score",22.0000000,0.9960000,,,,,-1.3800000
HNSSQFLSYLTK,ph,S,37,true,"TOR Kinase and ABA Receptor",100,29290610,XCorr,4.0281801,0.9996000,,,,1.5940000594128E-5,
HNSSQFLSYLTK,ph,S,37,true,"Tissue atlas Arabidopsis - ProteomicsDB",114,32188942,"MaxQuant score",328.0200000,0.9994420,,,,0,
AILEGPVCNGSQVIGWHTNEK,ng,N,280,true,"Conserved N-glycosylation",74,22633491,"MaxQuant Score",169.8100000,1.0000000,,,,0,-0.8120000
