Peptide,PTM,ModifiedAA,ModifiedPosition,PeptideUniqueToGene,ExperimentDesc,ExpID,PubmedID,ScoreType,IdentScore,LocProb,Log2FChange,PQ-val,QuantSig,PEP,MassErrorPPM
AAPAAATARA,nt,A,2,true,"N-term acetylation drought responses",5,26184543,,,,,,,,
AAPAAATAR,nt,A,2,true,"Arg/N-end rule seed, prt6 vs. Wt",99,29168982,"MASCOT Score",43.7200000,,,,,0.12559999525547,-0.5945243
AAPAAATARAQALSLLAAANNHG,nta,A,2,true,"Arabidopsis translation initiation landscape - NTA",167a,35069635,,,,,,,,
AAPAAATARAQALSLLAAAN,nta,A,2,true,"HUNTER N-terminome: legumain, GluC and trypsin",119,31951383,"MaxQuant score",67.2750000,,,,,,
AAPAAATARA,nta,A,2,true,"N-term acetylation drought responses",5,26184543,,,,,,,,
AAPAAATAR,nta,A,2,true,"Characterization plant N-terminal acetylation",6,22223895,"MASCOT Score",60.2200000,,,,,,
AAPAAATAR,nta,A,2,true,"Arg/N-end rule seed, prt6 vs. Wt",99,29168982,"MASCOT Score",43.7200000,,,,,0.12559999525547,-0.5945243
NNQVISHQNSWDLSK,ph,S,356,true,"Tissue atlas Arabidopsis - ProteomicsDB",114,32188942,"MaxQuant score",210.5700000,0.9999950,,,,1.4012984643248E-45,
RLNSSVGPTSLPVGEGK,ph,S,545,true,"Tissue atlas Arabidopsis - ProteomicsDB",114,32188942,"MaxQuant score",94.3250000,0.8943370,,,,1.4830699910817E-5,
EISSLDVPLSPCR,ph,S,634,true,"Tissue atlas Arabidopsis - ProteomicsDB",114,32188942,"MaxQuant score",121.0100000,0.8027980,,,,6.5118700149469E-5,
EISSLDVPLSPCRDDEGIRETK,ph,S,640,true,"Arabidopsis root NAA phosphoproteome",18a,27643528,"MaxQuant Score",71.0600000,0.9090000,,,,5.7139999398714E-8,0.5680000
EISSLDVPLSPCRDDEGIRETK,ph,S,640,true,"PAMP-triggered phosphorylation",48,24601666,"MASCOT Score",23.9800000,,,,,,
EISSLDVPLSPCRDDEGIRETK,ph,S,640,true,"srk2dei ABA signaling phopshoproteomics",83,23572148,"MASCOT Score",79.0000000,,,,,,-0.0003000
EISSLDVPLSPCRDDEGIRETK,ph,S,640,true,"SnRK2 protein kinase substrates",85,23776212,XCorr,3.7466161,0.9340000,,,,6.5124600951094E-5,
EISSLDVPLSPCRDDEGIRETK,ph,S,640,true,"TOR Kinase and ABA Receptor",100,29290610,XCorr,2.7515721,0.9999000,,,,0.00010209999891231,
EISSLDVPLSPCRDDEGIR,ph,S,640,true,"STN8 phosphoproteome",38,21768351,"MASCOT Score",46.4000000,,,,,,
EISSLDVPLSPCRDDEGIR,ph,S,640,true,"Large-scale phosphorylation discovery",44,23111157,XCorr,2.5800000,,,,,,
EISSLDVPLSPCRDDEGIR,ph,S,640,true,"SnRK2 protein kinase substrates",85,23776212,XCorr,2.1496458,0.8930000,,,,0.095679298043251,
EISSLDVPLSPCRDDEGIR,ph,S,640,true,"atm and atr DNA damage response",88,25561503,"MASCOT Score",33.0000000,1.0000000,,,,,0.1400000
EISSLDVPLSPCRDDEGIR,ph,S,640,true,"TOR Kinase and ABA Receptor",100,29290610,XCorr,3.4530182,0.9638000,,,,0.052910000085831,
EISSLDVPLSPCRDDEGIR,ph,S,640,true,"Phospho cell culture sucrose/TOR",109,30833711,,,0.9995330,,,,,
EISSLDVPLSPCR,ph,S,640,true,"STN8 phosphoproteome",38,21768351,"MASCOT Score",67.1300000,,,,,,
EISSLDVPLSPCR,ph,S,640,true,"SnRK2 protein kinase substrates",85,23776212,XCorr,2.2185075,1.0000000,,,,0.00085457297973335,
EISSLDVPLSPCR,ph,S,640,true,"Lateral root-induction - NAA vs control",106,23328941,"MASCOT Score",28.0000000,,,,,,
EISSLDVPLSPCR,ph,S,640,true,"Tissue atlas Arabidopsis - ProteomicsDB",114,32188942,"MaxQuant score",229.6200000,1.0000000,,,,0,
SQMHPSDATSSIHGAALT,ph,T,1325,true,"Tissue atlas Arabidopsis - ProteomicsDB",114,32188942,"MaxQuant score",43.6400000,0.9992860,,,,0.0068512498401105,
