Peptide,PTM,ModifiedAA,ModifiedPosition,PeptideUniqueToGene,ExperimentDesc,ExpID,PubmedID,ScoreType,IdentScore,LocProb,Log2FChange,PQ-val,QuantSig,PEP,MassErrorPPM
EDDVLCLQGLKNSLIDPSSR,nt,E,25,true,"N-terminal ChaFRADIC",92,26010716,"MASCOT Score",23.4900000,,,,,1.9649999405402E-9,
EDDVLCLQGLKNSLIDPSSR,nt,E,25,true,"HUNTER N-terminome: legumain, GluC and trypsin",119,31951383,"MaxQuant score",69.7630000,,,,,,
EDDVLCLQGLKN,nt,E,25,true,"HUNTER N-terminome: legumain, GluC and trypsin",119,31951383,"MaxQuant score",117.7000000,,,,,,
LSSWSFPNSSASSICK,ng,N,52,true,"Conserved N-glycosylation",74,22633491,"MaxQuant Score",112.2200000,1.0000000,,,,7.2189997035732E-11,3.2400000
LSSWSFPNSSASSICK,ng,N,52,true,"UDP-GlcNAc transporter glycopeptide analysis",135,30224661,,,,,,,4.2148169719994E-14,0.5000000
LGGSIPTQIVECK,sno,C,144,true,"hot5-4 / wildtype, FAT-switch S-nitrosoproteome",169,37277371,,,,-0.3004622,0.0801499,NO,,
ADLPDGSALAVKR,ac,K,329,true,"Quantitative Acetylproteomics",101,29440448,,,,,,,,
LSACGFGEKQFR,ub,K,339,true,"Ubiquitination Membrane Proteins",120,33585938,,,,,,,,
LVGSRDSNDSSFNNGDLGELGYVAPEYSSTMVASLK,ph,S,456,true,"Brassinosteroid-Regulated Phosphorylation Dynamics",94,26187819,"MaxQuant Score",59.3520000,0.9640000,,,,0.0040000001899898,-2.0550000
LVGSRDSNDSSFNNGDLGELGYVAPEYSSTMVASLK,ph,S,459,true,"Brassinosteroid-Regulated Phosphorylation Dynamics",94,26187819,"MaxQuant Score",59.3520000,0.9220000,,,,0.0040000001899898,-2.0550000
LVGSRDSNDSSFNNGDLGELGYVAPEYSSTMVASLK,ph,S,460,true,"Brassinosteroid-Regulated Phosphorylation Dynamics",94,26187819,"MaxQuant Score",59.3520000,0.9220000,,,,0.0040000001899898,-2.0550000
HGVSEHYDEFPLVFNK,ph,S,586,true,"Large-scale phosphorylation discovery",44,23111157,XCorr,3.6120000,,,,,,
HGVSEHYDEFPLVFNK,ph,S,586,true,"atm and atr DNA damage response",88,25561503,"MASCOT Score",44.0000000,0.9980000,,,,,0.3800000
HGVSEHYDEFPLVFNK,ph,S,586,true,"TOR Kinase and ABA Receptor",100,29290610,XCorr,4.8488069,0.9997000,,,,1.3470000226334E-7,
HGVSEHYDEFPLVFNK,ph,S,586,true,"Phospho cell culture sucrose/TOR",109,30833711,,,0.9994280,,,,,
HGVSEHYDEFPLVFNK,ph,S,586,true,"Tissue atlas Arabidopsis - ProteomicsDB",114,32188942,"MaxQuant score",283.9800000,1.0000000,,,,0,
